Cyclopentanethiol, 1-methyl-
- Formula: C6H12S
- Molecular weight: 116.224
- IUPAC Standard InChIKey: XJWBHFDHEOPYNK-UHFFFAOYSA-N
- CAS Registry Number: 1638-95-5
- Chemical structure:
View 3d structure (requires JavaScript / HTML 5) - Other names: 1-Methylcyclopentanethiol

Phase change data

Data compiled by: Thermodynamics Research Center, NIST Boulder Laboratories, Chris Muzny director
Quantity | Value | Units | Method | Reference | Comment |
---|---|---|---|---|---|
Tboil | 410.75 | K | N/A | Lanum and Morris, 1969 | Uncertainty assigned by TRC = 0.2 K |

References

Lanum and Morris, 1969
Lanum, W.J.; Morris, J.C.,
Physical Properties of Some Sulfur and Nitrogen Compounds,
J. Chem. Eng. Data, 1969, 14, 93-8. [all data]