1-Butanol, 2-amino-3-methyl-, (.+/-.)-
- Formula: C5H13NO
- Molecular weight: 103.1628
- IUPAC Standard InChIKey: NWYYWIJOWOLJNR-UHFFFAOYSA-N
- CAS Registry Number: 16369-05-4
- Chemical structure:
View 3d structure (requires JavaScript / HTML 5) - Stereoisomers:
- Other names: (+-)-2-Amino-3-methyl-1-butanol; (±)-2-amino-3-methylbutan-1-ol

Phase change data

Data compiled by: Robert L. Brown and Stephen E. Stein
Quantity | Value | Units | Method | Reference | Comment |
---|---|---|---|---|---|
Tboil | 454. to 459. | K | N/A | Buckingham and Donaghy, 1982 |
Reduced pressure boiling point
Tboil (K) | Pressure (bar) | Reference |
---|---|---|
349.2 | 0.01 | Weast and Grasselli, 1989 |
368. to 373. | 0.013 | Buckingham and Donaghy, 1982 |

References

Buckingham and Donaghy, 1982
Buckingham, J.; Donaghy, S.M.,
Dictionary of Organic Compounds: Fifth Edition, Chapman and Hall, New York, 1982, 1. [all data]
Weast and Grasselli, 1989
CRC Handbook of Data on Organic Compounds, 2nd Editon, Weast,R.C and Grasselli, J.G., ed(s)., CRC Press, Inc., Boca Raton, FL, 1989, 1. [all data]