Octane, 4,5-diethyl-
- Formula: C12H26
- Molecular weight: 170.3348
- IUPAC Standard InChIKey: XRVCHXCONYJHLU-UHFFFAOYSA-N
- CAS Registry Number: 1636-41-5
- Chemical structure:
View 3d structure (requires JavaScript / HTML 5) - Other names: 4,5-diethyl-octane

Phase change data

Data compiled by: Thermodynamics Research Center, NIST Boulder Laboratories, Chris Muzny director
Quantity | Value | Units | Method | Reference | Comment |
---|---|---|---|---|---|
Tboil | 466. | K | N/A | Petrov and Kaplan, 1942 | Uncertainty assigned by TRC = 5. K |
Quantity | Value | Units | Method | Reference | Comment |
Tfus | 203. | K | N/A | Petrov and Kaplan, 1942 | Uncertainty assigned by TRC = 3. K |

Kovats' RI, non-polar column, isothermal

Column type | Active phase | Temperature (C) | I | Reference | Comment |
---|---|---|---|---|---|
Capillary | Squalane | 100. | 1093. | Mitra, Mohan, et al., 1974 | H2; Column length: 50. m; Column diameter: 0.2 mm |
Capillary | Apiezon L | 100. | 1083. | Rappoport and Gäumann, 1973 | |
Packed | SE-30 | 70. | 1096. | Widmer, 1967 | Diatoport S; Column length: 7.9 m |

Kovats' RI, polar column, isothermal

Column type | Active phase | Temperature (C) | I | Reference | Comment |
---|---|---|---|---|---|
Packed | Carbowax 20M | 130. | 1091. | Widmer, 1967 | Diatoport P; Column length: 7.9 m |
Packed | Carbowax 20M | 70. | 1092. | Widmer, 1967 | Diatoport P; Column length: 7.9 m |

References

Petrov and Kaplan, 1942
Petrov, A.D.; Kaplan, E.P.,
Zh. Obshch. Khim., 1942, 12, 99. [all data]
Mitra, Mohan, et al., 1974
Mitra, G.D.; Mohan, G.; Sinha, A.,
Gas chromatographic analysis of complex hydrocarbon mixtures,
J. Chromatogr. A, 1974, 91, 633-648, https://doi.org/10.1016/S0021-9673(01)97944-0
. [all data]
Rappoport and Gäumann, 1973
Rappoport, S.; Gäumann, T.,
114. L'indice de rétention des alcanes isomères en chromatographie en phase gazeuse,
Helv. Chim. Acta, 1973, 56, 3, 1145-1158, https://doi.org/10.1002/hlca.19730560338
. [all data]
Widmer, 1967
Widmer, H.,
Gas chromatographic identification of hydrocarbons using retention indices,
J. Gas Chromatogr., 1967, 5, 10, 506-510, https://doi.org/10.1093/chromsci/5.10.506
. [all data]