EtO anion
- Formula: C2H5O-
- Molecular weight: 45.0610
- CAS Registry Number: 16331-64-9

Ion clustering data

Data compiled as indicated in comments:
B - John E. Bartmess
M - Michael M. Meot-Ner (Mautner) and Sharon G. Lias
Clustering reactions
C2H5O- + = C3H6F3O-
By formula: C2H5O- + CHF3 = C3H6F3O-
Quantity | Value | Units | Method | Reference | Comment |
---|---|---|---|---|---|
ΔrH° | 92.0 ± 4.2 | kJ/mol | IMRE | Chabinyc and Brauman, 1998 | gas phase; B |
Quantity | Value | Units | Method | Reference | Comment |
ΔrG° | 63.2 ± 4.2 | kJ/mol | IMRE | Chabinyc and Brauman, 1998 | gas phase; B |
By formula: C2H5O- + CH4O = (C2H5O- • CH4O)
Quantity | Value | Units | Method | Reference | Comment |
---|---|---|---|---|---|
ΔrH° | 114. ± 12. | kJ/mol | IMRE | Caldwell, Rozeboom, et al., 1984 | gas phase; Reanchored to average data from Paul and Kebarle, 1990 and Meot-ner and Sieck, 1986.; value altered from reference due to change in acidity scale; B,M |
ΔrH° | 107. ± 7.9 | kJ/mol | CIDT | DeTuri and Ervin, 1999 | gas phase; B |
Quantity | Value | Units | Method | Reference | Comment |
ΔrS° | 123. | J/mol*K | N/A | Caldwell, Rozeboom, et al., 1984 | gas phase; switching reaction(CH3O-)CH3OH, Entropy change calculated or estimated; re-evaluated using Meot-Ner(Mautner), 1986 and Paul and Kebarle, 1990; M |
Quantity | Value | Units | Method | Reference | Comment |
ΔrG° | 77.8 ± 8.4 | kJ/mol | IMRE | Caldwell, Rozeboom, et al., 1984 | gas phase; Reanchored to average data from Paul and Kebarle, 1990 and Meot-ner and Sieck, 1986.; value altered from reference due to change in acidity scale; B,M |
Free energy of reaction
ΔrG° (kJ/mol) | T (K) | Method | Reference | Comment |
---|---|---|---|---|
56.1 | 296. | FA | Mackay, Rakshit, et al., 1982 | gas phase; From thermochemical cycle,switching reaction(CH3O-)CH3OH; Caldwell and Kebarle, 1986, Taft, 1983; M |
(C2H5O- • 4294967295) +
= C2H5O-
By formula: (C2H5O- • 4294967295C2H4O) + C2H4O = C2H5O-
Quantity | Value | Units | Method | Reference | Comment |
---|---|---|---|---|---|
ΔrH° | 158. ± 4.2 | kJ/mol | N/A | Ramond, Davico, et al., 2000 | gas phase; B |
ΔrH° | 165. ± 9.2 | kJ/mol | Ther | Bartmess, Scott, et al., 1979 | gas phase; value altered from reference due to change in acidity scale; B |
By formula: C2H5O- + C2H6O = (C2H5O- • C2H6O)
Quantity | Value | Units | Method | Reference | Comment |
---|---|---|---|---|---|
ΔrH° | 115. ± 4.2 | kJ/mol | TDEq | Meot-Ner and Sieck, 1986 | gas phase; B,M |
ΔrH° | 118. ± 10. | kJ/mol | N/A | Caldwell, Rozeboom, et al., 1984 | gas phase; Reanchored to average data from Paul and Kebarle, 1990 and Meot-ner and Sieck, 1986.; value altered from reference due to change in acidity scale; B,M |
Quantity | Value | Units | Method | Reference | Comment |
ΔrS° | 112. | J/mol*K | PHPMS | Meot-Ner and Sieck, 1986 | gas phase; M |
ΔrS° | 123. | J/mol*K | N/A | Caldwell, Rozeboom, et al., 1984 | gas phase; switching reaction(CH3O-)CH3OH; Entropy change calculated or estimated; re-evaluated using Meot-Ner(Mautner), 1986 and Paul and Kebarle, 1990; M |
Quantity | Value | Units | Method | Reference | Comment |
ΔrG° | 82.0 ± 6.7 | kJ/mol | TDEq | Meot-Ner and Sieck, 1986 | gas phase; B |
ΔrG° | 79.5 ± 6.7 | kJ/mol | IMRE | Caldwell, Rozeboom, et al., 1984 | gas phase; Reanchored to average data from Paul and Kebarle, 1990 and Meot-ner and Sieck, 1986.; value altered from reference due to change in acidity scale; B,M |
ΔrG° | 84.1 | kJ/mol | ICR | McIver, Scott, et al., 1973 | gas phase; switching reaction(CH3O-)CH3OH, Entropy change calculated or estimated; Meot-Ner (Mautner), 1992; M |

Reaction thermochemistry data

Data compiled as indicated in comments:
B - John E. Bartmess
M - Michael M. Meot-Ner (Mautner) and Sharon G. Lias

Individual Reactions

C2H5O- + Ethanol = (C2H5O- • Ethanol)

By formula: C2H5O- + C2H6O = (C2H5O- • C2H6O)

Quantity Value Units Method Reference Comment
Δr115. ± 4.2kJ/molTDEqMeot-Ner and Sieck, 1986gas phase; B,M
Δr118. ± 10.kJ/molN/ACaldwell, Rozeboom, et al., 1984gas phase; Reanchored to average data from Paul and Kebarle, 1990 and Meot-ner and Sieck, 1986.; value altered from reference due to change in acidity scale; B,M
Quantity Value Units Method Reference Comment
Δr112.J/mol*KPHPMSMeot-Ner and Sieck, 1986gas phase; M
Δr123.J/mol*KN/ACaldwell, Rozeboom, et al., 1984gas phase; switching reaction(CH3O-)CH3OH; Entropy change calculated or estimated; re-evaluated using Meot-Ner(Mautner), 1986 and Paul and Kebarle, 1990; M
Quantity Value Units Method Reference Comment
Δr82.0 ± 6.7kJ/molTDEqMeot-Ner and Sieck, 1986gas phase; B
Δr79.5 ± 6.7kJ/molIMRECaldwell, Rozeboom, et al., 1984gas phase; Reanchored to average data from Paul and Kebarle, 1990 and Meot-ner and Sieck, 1986.; value altered from reference due to change in acidity scale; B,M
Δr84.1kJ/molICRMcIver, Scott, et al., 1973gas phase; switching reaction(CH3O-)CH3OH, Entropy change calculated or estimated; Meot-Ner (Mautner), 1992; M

C2H5O- + Methyl Alcohol = (C2H5O- • Methyl Alcohol)

By formula: C2H5O- + CH4O = (C2H5O- • CH4O)

Quantity Value Units Method Reference Comment
Δr114. ± 12.kJ/molIMRECaldwell, Rozeboom, et al., 1984gas phase; Reanchored to average data from Paul and Kebarle, 1990 and Meot-ner and Sieck, 1986.; value altered from reference due to change in acidity scale; B,M
Δr107. ± 7.9kJ/molCIDTDeTuri and Ervin, 1999gas phase; B
Quantity Value Units Method Reference Comment
Δr123.J/mol*KN/ACaldwell, Rozeboom, et al., 1984gas phase; switching reaction(CH3O-)CH3OH, Entropy change calculated or estimated; re-evaluated using Meot-Ner(Mautner), 1986 and Paul and Kebarle, 1990; M
Quantity Value Units Method Reference Comment
Δr77.8 ± 8.4kJ/molIMRECaldwell, Rozeboom, et al., 1984gas phase; Reanchored to average data from Paul and Kebarle, 1990 and Meot-ner and Sieck, 1986.; value altered from reference due to change in acidity scale; B,M

Free energy of reaction

ΔrG° (kJ/mol) T (K) Method Reference Comment
56.1296.FAMackay, Rakshit, et al., 1982gas phase; From thermochemical cycle,switching reaction(CH3O-)CH3OH; Caldwell and Kebarle, 1986, Taft, 1983; M

C2H5O- + Hydrogen cation = Ethanol

By formula: C2H5O- + H+ = C2H6O

Quantity Value Units Method Reference Comment
Δr1587. ± 4.2kJ/molD-EARamond, Davico, et al., 2000gas phase; B
Δr1582. ± 8.4kJ/molCIDCHaas and Harrison, 1993gas phase; Both metastable and 50 eV collision energy.; B
Δr1579. ± 8.8kJ/molG+TSBartmess, Scott, et al., 1979gas phase; value altered from reference due to change in acidity scale; B
Δr1586.2 ± 0.42kJ/molCIDTDeTuri and Ervin, 1999gas phase; B
Quantity Value Units Method Reference Comment
Δr1559. ± 4.6kJ/molH-TSRamond, Davico, et al., 2000gas phase; B
Δr1554. ± 8.8kJ/molH-TSHaas and Harrison, 1993gas phase; Both metastable and 50 eV collision energy.; B
Δr1551. ± 8.4kJ/molIMREBartmess, Scott, et al., 1979gas phase; value altered from reference due to change in acidity scale; B

(C2H5O- • 4294967295Acetaldehyde) + Acetaldehyde = C2H5O-

By formula: (C2H5O- • 4294967295C2H4O) + C2H4O = C2H5O-

Quantity Value Units Method Reference Comment
Δr158. ± 4.2kJ/molN/ARamond, Davico, et al., 2000gas phase; B
Δr165. ± 9.2kJ/molTherBartmess, Scott, et al., 1979gas phase; value altered from reference due to change in acidity scale; B

C2H5O- + Fluoroform = C3H6F3O-

By formula: C2H5O- + CHF3 = C3H6F3O-

Quantity Value Units Method Reference Comment
Δr92.0 ± 4.2kJ/molIMREChabinyc and Brauman, 1998gas phase; B
Quantity Value Units Method Reference Comment
Δr63.2 ± 4.2kJ/molIMREChabinyc and Brauman, 1998gas phase; B

Gas phase ion energetics data

Data compiled by: John E. Bartmess

Electron affinity of neutral species

EAneutral (eV) Method Reference Comment
1.7120 ± 0.0040LPESRamond, Davico, et al., 2000
1.7150 ± 0.0070LPESDang, Motell, et al., 1993
1.726 ± 0.033LPESEllison, Engleking, et al., 1982
1.79 ± 0.10D-EABartmess, Scott, et al., 1979value altered from reference due to change in acidity scale
1.68 ± 0.10EIAEWilliams and Hamill, 1968From EtONO
>1.7EIAETrepka and Neuert, 1963From EtOH
0.589753SIPage and Goode, 1969The Magnetron method, lacking mass analysis, is not considered reliable.

Protonation reactions

C2H5O- + Hydrogen cation = Ethanol

By formula: C2H5O- + H+ = C2H6O

Quantity Value Units Method Reference Comment
Δr1587. ± 4.2kJ/molD-EARamond, Davico, et al., 2000gas phase
Δr1582. ± 8.4kJ/molCIDCHaas and Harrison, 1993gas phase; Both metastable and 50 eV collision energy.
Δr1579. ± 8.8kJ/molG+TSBartmess, Scott, et al., 1979gas phase; value altered from reference due to change in acidity scale
Δr1586.2 ± 0.42kJ/molCIDTDeTuri and Ervin, 1999gas phase
Quantity Value Units Method Reference Comment
Δr1559. ± 4.6kJ/molH-TSRamond, Davico, et al., 2000gas phase
Δr1554. ± 8.8kJ/molH-TSHaas and Harrison, 1993gas phase; Both metastable and 50 eV collision energy.
Δr1551. ± 8.4kJ/molIMREBartmess, Scott, et al., 1979gas phase; value altered from reference due to change in acidity scale

References

Chabinyc and Brauman, 1998
Chabinyc, M.L.; Brauman, J.I.,
Acidity, basicity, and the stability of hydrogen bonds: Complexes of RO-+HCF3,
J. Am. Chem. Soc., 1998, 120, 42, 10863-10870, https://doi.org/10.1021/ja9817592
. [all data]
Caldwell, Rozeboom, et al., 1984
Caldwell, G.; Rozeboom, M.D.; Kiplinger, J.P.; Bartmess, J.E.,
Anion-alcohol hydrogen bond strengths in the gas phase,
J. Am. Chem. Soc., 1984, 106, 4660. [all data]
Paul and Kebarle, 1990
Paul, G.J.C.; Kebarle, P.,
Thermodynamics of the Association Reactions OH- - H2O = HOHOH- and CH3O- - CH3OH = CH3OHOCH3- in the Gas Phase,
J. Phys. Chem., 1990, 94, 12, 5184, https://doi.org/10.1021/j100375a076
. [all data]
Meot-ner and Sieck, 1986
Meot-ner, M.; Sieck, L.W.,
Relative acidities of water and methanol, and the stabilities of the dimer adducts,
J. Phys. Chem., 1986, 90, 6687. [all data]
DeTuri and Ervin, 1999
DeTuri, V.F.; Ervin, K.M.,
Competitive threshold collision-induced dissociation: Gas-phase acidities and bond dissociation energies for a series of alcohols,
J. Phys. Chem. A, 1999, 103, 35, 6911-6920, https://doi.org/10.1021/jp991459m
. [all data]
Meot-Ner(Mautner), 1986
Meot-Ner(Mautner), M.,
Comparative Stabilities of Cationic and Anionic Hydrogen-Bonded Networks. Mixed Clusters of Water-Methanol,
J. Am. Chem. Soc., 1986, 108, 20, 6189, https://doi.org/10.1021/ja00280a014
. [all data]
Mackay, Rakshit, et al., 1982
Mackay, G.I.; Rakshit, A.B.; Bohme, D.K.,
An Experimental Study of the Reactivity and Relative Basicity of the Methoxide Anion in the Gas Phase at Room Temperature, and their Perturbation by Methanol Solvent,
Can. J. Chem., 1982, 60, 20, 2594, https://doi.org/10.1139/v82-373
. [all data]
Caldwell and Kebarle, 1986
Caldwell, G.; Kebarle, P.,
Mobility of Gaseous Ions in Weak Electric Fields
in Unpublished results, 1986. [all data]
Taft, 1983
Taft, R.W.,
Protonic acidities and basicities in the gas phase and in solution: Substiuent and solvent effects,
Prog. Phys. Org. Chem., 1983, 14, 247. [all data]
Ramond, Davico, et al., 2000
Ramond, T.M.; Davico, G.E.; Schwartz, R.L.; Lineberger, W.C.,
Vibronic structure of alkoxy radicals via photoelectron spectroscopy,
J. Chem. Phys., 2000, 112, 3, 1158-1169, https://doi.org/10.1063/1.480767
. [all data]
Bartmess, Scott, et al., 1979
Bartmess, J.E.; Scott, J.A.; McIver, R.T., Jr.,
The gas phase acidity scale from methanol to phenol,
J. Am. Chem. Soc., 1979, 101, 6047. [all data]
Meot-Ner and Sieck, 1986
Meot-Ner, M.; Sieck, L.W.,
The ionic hydrogen bond and ion solvation. 5. OH...O- bonds. Gas phase solvation and clustering of alkoxide and carboxylate anions,
J. Am. Chem. Soc., 1986, 108, 7525. [all data]
McIver, Scott, et al., 1973
McIver, R.T., Jr.; Scott, J.A.; Riveros, J.M.,
Effect of solvation on the intrinsic relative acidity of methanol and ethanol,
J. Am. Chem. Soc., 1973, 95, 2706. [all data]
Meot-Ner (Mautner), 1992
Meot-Ner (Mautner), M.,
Intermolecular Forces in Organic Clusters,
J. Am. Chem. Soc., 1992, 114, 9, 3312, https://doi.org/10.1021/ja00035a024
. [all data]