Nonane, 4-ethyl-5-methyl-
- Formula: C12H26
- Molecular weight: 170.3348
- IUPAC Standard InChIKey: HKUUNAOHRKAJIY-UHFFFAOYSA-N
- CAS Registry Number: 1632-71-9
- Chemical structure:
View 3d structure (requires JavaScript / HTML 5) - Other names: 4-ethyl-5-methyl-nonane

Kovats' RI, non-polar column, isothermal

Column type | Active phase | Temperature (C) | I | Reference | Comment |
---|---|---|---|---|---|
Capillary | Squalane | 100. | 1114. | Mitra, Mohan, et al., 1974 | H2; Column length: 50. m; Column diameter: 0.2 mm |
Capillary | Apiezon L | 100. | 1106. | Rappoport and Gäumann, 1973 | |
Packed | SE-30 | 70. | 1118. | Widmer, 1967 | Diatoport S; Column length: 7.9 m |

Kovats' RI, polar column, isothermal

Column type | Active phase | Temperature (C) | I | Reference | Comment |
---|---|---|---|---|---|
Packed | Carbowax 20M | 130. | 1112. | Widmer, 1967 | Diatoport P; Column length: 7.9 m |
Packed | Carbowax 20M | 70. | 1112. | Widmer, 1967 | Diatoport P; Column length: 7.9 m |

References

Mitra, Mohan, et al., 1974
Mitra, G.D.; Mohan, G.; Sinha, A.,
Gas chromatographic analysis of complex hydrocarbon mixtures,
J. Chromatogr. A, 1974, 91, 633-648, https://doi.org/10.1016/S0021-9673(01)97944-0
. [all data]
Rappoport and Gäumann, 1973
Rappoport, S.; Gäumann, T.,
114. L'indice de rétention des alcanes isomères en chromatographie en phase gazeuse,
Helv. Chim. Acta, 1973, 56, 3, 1145-1158, https://doi.org/10.1002/hlca.19730560338
. [all data]
Widmer, 1967
Widmer, H.,
Gas chromatographic identification of hydrocarbons using retention indices,
J. Gas Chromatogr., 1967, 5, 10, 506-510, https://doi.org/10.1093/chromsci/5.10.506
. [all data]