Undecane, 5-methyl-
- Formula: C12H26
- Molecular weight: 170.3348
- IUPAC Standard InChIKey: QULNVKABFWNUCW-UHFFFAOYSA-N
- CAS Registry Number: 1632-70-8
- Chemical structure:
View 3d structure (requires JavaScript / HTML 5) - Other names: 5-Methylundecane; Methylundecane

Phase change data

Data compiled as indicated in comments:
TRC - Thermodynamics Research Center, NIST Boulder Laboratories, Chris Muzny director
AC - William E. Acree, Jr., James S. Chickos
Quantity | Value | Units | Method | Reference | Comment |
---|---|---|---|---|---|
Tfus | 205.4 | K | N/A | Petrov, Sergienko, et al., 1959 | Uncertainty assigned by TRC = 2. K; TRC |
Enthalpy of vaporization
ΔvapH (kJ/mol) | Temperature (K) | Method | Reference | Comment |
---|---|---|---|---|
50.3 | 372. | A | Stephenson and Malanowski, 1987 | Based on data from 357. to 480. K.; AC |

References

Petrov, Sergienko, et al., 1959
Petrov, A.A.; Sergienko, S.R.; Nechitailo, N.A.; Tsedilina, A.L.,
Izv. Akad. Nauk SSSR, 1959, 1959, 1091-7. [all data]
Stephenson and Malanowski, 1987
Stephenson, Richard M.; Malanowski, Stanislaw,
Handbook of the Thermodynamics of Organic Compounds, 1987, https://doi.org/10.1007/978-94-009-3173-2
. [all data]