2,4,4-Trimethyl-1-pentanol
- Formula: C8H18O
- Molecular weight: 130.2279
- IUPAC Standard InChIKey: ZNRVRWHPZZOTIE-UHFFFAOYSA-N
- CAS Registry Number: 16325-63-6
- Chemical structure:
View 3d structure (requires JavaScript / HTML 5) - Other names: 1-Pentanol, 2,4,4-trimethyl-; 2,4,4-trimethylpentan-1-ol

Phase change data

Data compiled as indicated in comments:
TRC - Thermodynamics Research Center, NIST Boulder Laboratories, Chris Muzny director
BS - Robert L. Brown and Stephen E. Stein
Quantity | Value | Units | Method | Reference | Comment |
---|---|---|---|---|---|
Tboil | 443.65 | K | N/A | Chambers and Foster, 1959 | Uncertainty assigned by TRC = 3. K; TRC |
Reduced pressure boiling point
Tboil (K) | Pressure (atm) | Reference | Comment |
---|---|---|---|
441.7 | 0.974 | Aldrich Chemical Company Inc., 1990 | BS |

References

Chambers and Foster, 1959
Chambers, R.R.; Foster, R.L.,
, 1959. [all data]
Aldrich Chemical Company Inc., 1990
Aldrich Chemical Company Inc.,
Catalog Handbook of Fine Chemicals, Aldrich Chemical Company, Inc., Milwaukee WI, 1990, 1. [all data]