1,2,5-tris(2-naphthyl)benzene

Phase change data

Data compiled by: Thermodynamics Research Center, NIST Boulder Laboratories, Chris Muzny director

Quantity Value Units Method Reference Comment
Tfus472.KN/AMagill, 1967Uncertainty assigned by TRC = 1. K

In addition to the Thermodynamics Research Center (TRC) data available from this site, much more physical and chemical property data is available from the following TRC products:

References

Magill, 1967
Magill, J.H., Physical Properties of Aromatic Hydrocarbons. III. A Test of the Adam---Gibbs Relaxation Model for Glass Formers Based on the Heat-Capacity Data of 1,3,5-tri-α-Naphthylbenzene, J. Chem. Phys., 1967, 47, 8, 2802, https://doi.org/10.1063/1.1712301 . [all data]