Heptane, 3-methylene-
- Formula: C8H16
- Molecular weight: 112.2126
- IUPAC Standard InChIKey: XTVRLCUJHGUXCP-UHFFFAOYSA-N
- CAS Registry Number: 1632-16-2
- Chemical structure:
View 3d structure (requires JavaScript / HTML 5) - Other names: 1-Hexene, 2-ethyl-; 2-Ethyl-1-hexene; 2-Ethylhexene; 2-Ethyl hexene-1; USAF DO-21; 2-Ethylhex-1-ene; 3-Methyleneheptane

Phase change data

Data compiled as indicated in comments:
TRC - Thermodynamics Research Center, NIST Boulder Laboratories, Chris Muzny director
AC - William E. Acree, Jr., James S. Chickos
Quantity | Value | Units | Method | Reference | Comment |
---|---|---|---|---|---|
Tboil | 392.6 | K | N/A | Wright, 1961 | Uncertainty assigned by TRC = 0.5 K; TRC |
Tboil | 392.6 | K | N/A | Wright, 1960 | Uncertainty assigned by TRC = 0.3 K; TRC |
Tboil | 392. | K | N/A | Petrov, Chel'tsova, et al., 1951 | Uncertainty assigned by TRC = 4. K; TRC |
Quantity | Value | Units | Method | Reference | Comment |
ΔvapH° | 39.7 | kJ/mol | N/A | Reid, 1972 | AC |

Kovats' RI, non-polar column, isothermal

View large format table.

Column type Active phase Temperature (C) I Reference Comment
CapillaryPetrocol DH30.786.3Soják, Addová, et al., 2004150. m/0.25 mm/1. μm, H2
CapillarySqualane30.777.8Soják, Addová, et al., 2004He; Column length: 93. m; Column diameter: 0.25 mm
CapillarySqualane40.779.Matukuma, 1969N2; Column length: 91.4 m; Column diameter: 0.25 mm
PackedDC-200100.788.Rohrschneider, 1966Column length: 4. m
PackedSqualane100.780.Rohrschneider, 1966Column length: 5. m
PackedApiezon L100.783.Rohrschneider, 1966Column length: 5. m

Kovats' RI, non-polar column, custom temperature program

View large format table.

Column type Active phase I Reference Comment
CapillaryPetrocol DH-100764.12Haagen-Smit Laboratory, 1997He; Column length: 100. m; Column diameter: 0.2 mm; Program: 5C(10min) => 5C/min => 50C(48min) => 1.5C/min => 195C(91min)

Kovats' RI, polar column, isothermal

View large format table.

Column type Active phase Temperature (C) I Reference Comment
PackedCarbowax 20M100.847.Rohrschneider, 1966Column length: 2. m

Van Den Dool and Kratz RI, non-polar column, temperature ramp

View large format table.

Column type Active phase I Reference Comment
CapillaryHP-5793.Insausti, Goñi, et al., 200550. m/0.32 mm/1.05 μm, He, 35. C @ 15. min, 8. K/min, 220. C @ 5. min
CapillarySPB-1766.68LECO Corporation, 200330. m/0.25 mm/0.25 μm, 40. C @ 2. min, 10. K/min, 250. C @ 2. min
CapillarySPB-1767.07LECO Corporation, 200330. m/0.25 mm/0.25 μm, 40. C @ 2. min, 10. K/min, 250. C @ 2. min
CapillaryDB-5777.1Xu, van Stee, et al., 200330. m/0.25 mm/1. μm, He, 2.5 K/min; Tstart: 50. C; Tend: 200. C
CapillaryPetrocol DH785.White, Hackett, et al., 1992100. m/0.25 mm/0.5 μm, He, 1. K/min; Tstart: 30. C; Tend: 220. C

Normal alkane RI, non-polar column, isothermal

View large format table.

Column type Active phase Temperature (C) I Reference Comment
CapillarySqualane70.779.Schomburg, 1966

Normal alkane RI, non-polar column, temperature ramp

View large format table.

Column type Active phase I Reference Comment
CapillaryPetrocol DH777.Supelco, 2012100. m/0.25 mm/0.50 μm, Helium, 20. C @ 15. min, 15. K/min, 220. C @ 30. min
CapillaryUltra-ALLOY-5790.Tsuge, Ohtan, et al., 201130. m/0.25 mm/0.25 μm, 40. C @ 2. min, 20. K/min, 320. C @ 13. min
CapillaryPetrocol DH786.Sojak, Kubinec, et al., 2006150. m/0.25 mm/1.0 μm, 1. K/min; Tstart: 40. C; Tend: 300. C
CapillaryPetrocol DH786.Sojak, Kubinec, et al., 2006150. m/0.25 mm/1.0 μm, 1. K/min; Tstart: 40. C; Tend: 300. C
CapillaryHP-5755.García, Martín, et al., 200060. m/0.32 mm/1. μm, He, 3. K/min; Tstart: 40. C; Tend: 240. C

References

Wright, 1961
Wright, F.J.,
Influence of temperature on viscosity of nonassociated liquids,
J. Chem. Eng. Data, 1961, 6, 454. [all data]
Wright, 1960
Wright, F.J.,
Latent Heat of Vaporization and Composition,
Recl. Trav. Chim. Pays-Bas, 1960, 79, 784-9. [all data]
Petrov, Chel'tsova, et al., 1951
Petrov, A.D.; Chel'tsova, M.A.; Batu'ev, M.I.,
Mechanism of isomerization of olefinic hydrocarbons,
Izv. Akad. Nauk SSSR, 1951, 1951, 571-5. [all data]
Reid, 1972
Reid, Robert C.,
Handbook on vapor pressure and heats of vaporization of hydrocarbons and related compounds, R. C. Wilhort and B. J. Zwolinski, Texas A Research Foundation. College Station, Texas(1971). 329 pages.$10.00,
AIChE J., 1972, 18, 6, 1278-1278, https://doi.org/10.1002/aic.690180637
. [all data]