1,3-Benzenediamine, 2,4,6-trinitro-
- Formula: C6H5N5O6
- Molecular weight: 243.1338
- IUPAC Standard InChIKey: FZAZPMLWYUKRAE-UHFFFAOYSA-N
- CAS Registry Number: 1630-08-6
- Chemical structure:
View 3d structure (requires JavaScript / HTML 5) - Species with the same structure:
- Other names: m-Phenylenediamine, 2,4,6-trinitro-; DATB; 1,3-Diamino-2,4,6-trinitrobenzene; 2,4-Diamino-1,3,5-trinitrobenzene; 2,4,6-Trinitro-1,3-benzenediamine; 2,4,6-trinitrobenzene-1,3-diamine

Condensed phase thermochemistry data

Data compiled by: Hussein Y. Afeefy, Joel F. Liebman, and Stephen E. Stein
Quantity | Value | Units | Method | Reference | Comment |
---|---|---|---|---|---|
ΔfH°solid | -23.4 ± 0.8 | kcal/mol | Ccb | Rouse, 1976 | |
ΔfH°solid | -29.24 | kcal/mol | Ccb | Handrick, 1956 | Naval Ordnance Test Station, Propellants and Explosives, Navord 6597 |
Quantity | Value | Units | Method | Reference | Comment |
ΔcH°solid | -711.7 ± 0.3 | kcal/mol | Ccb | Rouse, 1976 | |
ΔcH°solid | -705.91 | kcal/mol | Ccb | Handrick, 1956 | Naval Ordnance Test Station, Propellants and Explosives, Navord 6597 |

References

Rouse, 1976
Rouse, P.E., Jr.,
Enthalpies of formation and calculated detonation properties of some thermally stable explosives,
J. Chem. Eng. Data, 1976, 21, 16-20. [all data]
Handrick, 1956
Handrick, G.R.,
Report of the study of pure explosive compounds. Part IV. Calculation of heat of combustion of organic compounds from structural features and calculation of power of high explosives, Rpt. C-58247 for the Office of the Chief of Ordnance, contract DA-19-020-ORD-47 by the Arthur D. Little, Inc., Cambridge, MA, 1956, 467-573. [all data]