Benzene, (3-methoxy-1-propenyl)-
- Formula: C10H12O
- Molecular weight: 148.2017
- IUPAC Standard InChIKey: XOURNDFHPYLQDJ-VMPITWQZSA-N
- CAS Registry Number: 16277-67-1
- Chemical structure:
View 3d structure (requires JavaScript / HTML 5) - Other names: Cinnamyl methyl ether; (3-methoxy-1-propenyl)benzene

Normal alkane RI, non-polar column, temperature ramp

Column type | Active phase | I | Reference | Comment |
---|---|---|---|---|
Capillary | OV-101 | 1250. | Zenkevich, Kharicheva, et al., 1999 | Helium, 60. C @ 0. min, 6. K/min, 240. C @ 0. min; Column length: 25. m; Column diameter: 0.20 mm |

Normal alkane RI, non-polar column, custom temperature program

Column type | Active phase | I | Reference | Comment |
---|---|---|---|---|
Capillary | SE-30 | 1237. | Vinogradov, 2004 | Program: not specified |
Capillary | Polydimethyl siloxanes | 1237. | Zenkevich, 1997 | Program: not specified |

References

Zenkevich, Kharicheva, et al., 1999
Zenkevich, I.G.; Kharicheva, E.M.; Kostikov, R.R.,
Application of Molecular Dynamics Methods in Chromato Mass Spectral Identification of Products of Interaction of Ethoxycarbonylcarbene with Various Substrates,
Zh. Org. Khim. (Rus.), 1999, 35, 11, 1600-1606. [all data]
Vinogradov, 2004
Vinogradov, B.A.,
Production, composition, properties and application of essential oils, 2004, retrieved from http://viness.narod.ru. [all data]
Zenkevich, 1997
Zenkevich, I.G.,
Analytical Parameters of Components of Essential Oils for their Chromatographic and Chromato-Spectral Identificaiton. Oxsigenated derivatives of Mono- and Sesquiterpene Hydrocarbons,
Rastit, Resursy (Rus.), 1997, 33, 1, 16-28. [all data]