Anthracene photodimer
- Formula: C28H20
- Molecular weight: 356.4584
- IUPAC Standard InChIKey: JUTIJVADGQDBGY-UHFFFAOYSA-N
- CAS Registry Number: 1627-06-1
- Chemical structure:
View 3d structure (requires JavaScript / HTML 5) - Other names: Anthracene, dimer; Dianthracene; 5,12:6,11-Di-o-benzenodibenzo(a,e)cyclooctene, 5,6,11,12-tetrahydro-; 5,12(1',2'):6,11(1'',2'')-Dibenzenodibenzo(a,e)cyclooctene, 5,6,11,12-tetrahydro-

Condensed phase thermochemistry data

Data compiled by: Hussein Y. Afeefy, Joel F. Liebman, and Stephen E. Stein
Quantity | Value | Units | Method | Reference | Comment |
---|---|---|---|---|---|
ΔfH°solid | 306. | kJ/mol | Ccb | Bender and Farber, 1952 | |
Quantity | Value | Units | Method | Reference | Comment |
ΔcH°solid | -14183. | kJ/mol | Ccb | Bender and Farber, 1952 | Corresponding ΔfHºsolid = 306. kJ/mol (simple calculation by NIST; no Washburn corrections) |
ΔcH°solid | -14169. | kJ/mol | Ccb | Swietoslawski and Starczewska, 1928 | Heat of combustion corrected for constant pressure; Corresponding ΔfHºsolid = 292. kJ/mol (simple calculation by NIST; no Washburn corrections) |

Reaction thermochemistry data

Data compiled by: Hussein Y. Afeefy, Joel F. Liebman, and Stephen E. Stein
Individual Reactions
By formula: C28H20 = 2C14H10
Quantity | Value | Units | Method | Reference | Comment |
---|---|---|---|---|---|
ΔrH° | -67.0 | kJ/mol | Cm | Bendig, Buchwitz, et al., 1981 | liquid phase; solvent: Cyclohexane; Dimerization, see Bendig and Kreysig, 1981 |
ΔrH° | 28.9 ± 6.1 | kJ/mol | Cm | Donati, Guarini, et al., 1981 | solid phase |

References

Bender and Farber, 1952
Bender, P.; Farber, J.,
The heats of combustion of anthracene transannular peroxide and dianthracene,
J. Am. Chem. Soc., 1952, 74, 1450-1452. [all data]
Swietoslawski and Starczewska, 1928
Swietoslawski, W.; Starczewska, H.,
Influence of certain corrections on the results of measurements of the heat of combustion of organic substances,
Bull. Int. Acad. Pol. Sci. Lett. Cl. Med., 1928, 85-97. [all data]
Bendig, Buchwitz, et al., 1981
Bendig, J.; Buchwitz, W.; Fischer, J.; Kreysig, D.,
Deactivation behavior of arenes and heteroarenes. XXXII. Effect of endo- and exocyclic substitution on the reversible dimerization behavior of anthracenes,
J. Prakt. Chem., 1981, 323, 485-498. [all data]
Bendig and Kreysig, 1981
Bendig, J.; Kreysig, D.,
Deactivation behavior of arenes and heteroarenes. XXXI. A model of the reversible photodimerization of anthracene and 9-methylanthracene,
J. Prakt. Chem., 1981, 323, 471-484. [all data]
Donati, Guarini, et al., 1981
Donati, D.; Guarini, G.G.T.; Sarti-Fantoni, P.,
Evaluation of the enthalpic change during the monomerization reaction of crystalline anthracene photodimer (AD),
Mol. Cryst. Liq. Cryst., 1981, 69, 241-243. [all data]