1-Morpholinyl-3,5-bis(dimethylamino)-s-triazine
- Formula: C11H20N6O
- Molecular weight: 252.3161
- IUPAC Standard InChIKey: ZESWVANGKAFGLW-UHFFFAOYSA-N
- CAS Registry Number: 16269-02-6
- Chemical structure:
View 3d structure (requires JavaScript / HTML 5) - Permanent link for this species. Use this link for bookmarking this species for future reference.

Phase change data

Data compiled as indicated in comments:
TRC - Thermodynamics Research Center, NIST Boulder Laboratories, Chris Muzny director
AC - William E. Acree, Jr., James S. Chickos
Quantity | Value | Units | Method | Reference | Comment |
---|---|---|---|---|---|
Tfus | 397.35 | K | N/A | Braxton and Rytting, 1989 | Uncertainty assigned by TRC = 1. K; TRC |
Enthalpy of fusion
ΔfusH (kcal/mol) | Temperature (K) | Method | Reference | Comment |
---|---|---|---|---|
5.901 | 397.4 | DSC | Acree, 1991 | AC |

References

Braxton and Rytting, 1989
Braxton, B.K.; Rytting, J.H.,
Solubilities and solution thermodynamics of several substituted melamines,
Thermochim. Acta, 1989, 154, 1, 27, https://doi.org/10.1016/0040-6031(89)87116-3
. [all data]
Acree, 1991
Acree, William E.,
Thermodynamic properties of organic compounds: enthalpy of fusion and melting point temperature compilation,
Thermochimica Acta, 1991, 189, 1, 37-56, https://doi.org/10.1016/0040-6031(91)87098-H
. [all data]