2-Fluoroamphetamine

Normal alkane RI, non-polar column, isothermal

View large format table.

Column type Active phase Temperature (C) I Reference Comment
CapillaryDB-190.1106.Rosner, Quednow, et al., 200530. m/0.32 mm/0.25 μm, Helium

References

Rosner, Quednow, et al., 2005
Rosner, P.; Quednow, B.; Girreser, U.; Junge, T., Isomeric fluoro-methoxy-phenylalkylamines: a new series of controlled-substance analogues (designer drugs), Forensic Sci. International, 2005, 148, 2-3, 143-156, https://doi.org/10.1016/j.forsciint.2004.05.003 . [all data]