1,4-bis(4-nitrophenyl)piperazine
- Formula: C16H16N4O4
- Molecular weight: 328.3226
- IUPAC Standard InChIKey: VCZGAOMAWKGNEF-UHFFFAOYSA-N
- CAS Registry Number: 16264-05-4
- Chemical structure:
View 3d structure (requires JavaScript / HTML 5) - Other names: 1,4-bis(p-nitrophenyl)piperazine

Phase change data

Data compiled by: Thermodynamics Research Center, NIST Boulder Laboratories, Chris Muzny director
Quantity | Value | Units | Method | Reference | Comment |
---|---|---|---|---|---|
Tfus | 534.15 | K | N/A | Aroney and Le Fevre, 1960 | Uncertainty assigned by TRC = 6. K; with decomposition |

References

Aroney and Le Fevre, 1960
Aroney, M.; Le Fevre, R.J.W.,
Molecular polarizability. The conformation of various n-substituted anilines, piperidines, and piperazines,
J. Chem. Soc., 1960, 1960, 2161. [all data]