9,10-Dihydro-9,10-ethanoanthracene-11,11,12,12-tetracarbonitrile
- Formula: C20H10N4
- Molecular weight: 306.3202
- IUPAC Standard InChIKey: BZIGFCWZJSWLLX-UHFFFAOYSA-N
- CAS Registry Number: 1625-84-9
- Chemical structure:
View 3d structure (requires JavaScript / HTML 5) - Permanent link for this species. Use this link for bookmarking this species for future reference.

Reaction thermochemistry data

Data compiled by: Hussein Y. Afeefy, Joel F. Liebman, and Stephen E. Stein
Individual Reactions
By formula: C20H10N4 = C14H10 + C6N4
Quantity | Value | Units | Method | Reference | Comment |
---|---|---|---|---|---|
ΔrH° | 40.5 ± 2.1 | kJ/mol | Cm | Rogers, 1972 | solid phase |

References

Rogers, 1972
Rogers, F.E.,
Thermochemistry of the Diels-Alder reactions. II. Heat of addition of several dienes to tetracyanoethylene,
J. Phys. Chem., 1972, 76, 106-109. [all data]