Pentane, 2,4-dibromo-, (R*,R*)-(±)-
- Formula: C5H10Br2
- Molecular weight: 229.941
- IUPAC Standard InChIKey: KUZOHDYKJXNCSI-WHFBIAKZSA-N
- CAS Registry Number: 1625-68-9
- Chemical structure:
View 3d structure (requires JavaScript / HTML 5) - Stereoisomers:

Reaction thermochemistry data

Data compiled by: Hussein Y. Afeefy, Joel F. Liebman, and Stephen E. Stein
Individual Reactions
By formula: C5H10Br2 = C5H10Br2
Quantity | Value | Units | Method | Reference | Comment |
---|---|---|---|---|---|
ΔrH° | -7.99 | kJ/mol | Eqk | Rozhnov, Alenin, et al., 1974 | liquid phase |
By formula: C5H10Br2 = C5H10Br2
Quantity | Value | Units | Method | Reference | Comment |
---|---|---|---|---|---|
ΔrH° | -2.4 | kJ/mol | Eqk | Rozhnov, Alenin, et al., 1974 | liquid phase |
By formula: C5H10Br2 = C5H10Br2
Quantity | Value | Units | Method | Reference | Comment |
---|---|---|---|---|---|
ΔrH° | 6.02 | kJ/mol | Eqk | Rozhnov, Alenin, et al., 1974 | liquid phase |

References

Rozhnov, Alenin, et al., 1974
Rozhnov, A.M.; Alenin, V.I.; Nesterova, T.N.; Nedoshivina, A.E.,
The isomerisation equilibria of dibromoalkanes. III. Isomerisation of 1,4-, 2,3-, and 2,4-dibromopentanes,
Russ. J. Phys. Chem. (Engl. Transl.), 1974, 48, 1114. [all data]