4-Octylaniline
- Formula: C14H23N
- Molecular weight: 205.3391
- IUPAC Standard InChIKey: ORKQJTBYQZITLA-UHFFFAOYSA-N
- CAS Registry Number: 16245-79-7
- Chemical structure:
View 3d structure (requires JavaScript / HTML 5) - Other names: p-Octylaniline; 4-n-Octylaniline; Benzenamine, 4-octyl-; 4-(n-C8H17)C6H4NH2

Phase change data

Data compiled by: Robert L. Brown and Stephen E. Stein
Reduced pressure boiling point
Tboil (K) | Pressure (bar) | Reference |
---|---|---|
448.2 | 0.017 | Aldrich Chemical Company Inc., 1990 |
455. to 458. | 0.020 | Frinton Laboratories Inc., 1986 |

Reaction thermochemistry data

Data compiled by: Michael M. Meot-Ner (Mautner) and Sharon G. Lias
Individual Reactions
By formula: C14H24N+ + C14H23N = (C14H24N+ • C14H23N)
Free energy of reaction
ΔrG° (kJ/mol) | T (K) | Method | Reference | Comment |
---|---|---|---|---|
46.9 | 500. | PHPMS | Sunner, Kulatunga, et al., 1986 | gas phase |

Gas phase ion energetics data

Data evaluated by: Edward P. Hunter and Sharon G. Lias
Quantity | Value | Units | Method | Reference | Comment |
---|---|---|---|---|---|
Proton affinity (review) | 894.5 | kJ/mol | N/A | Hunter and Lias, 1998 | |
Quantity | Value | Units | Method | Reference | Comment |
Gas basicity | 862. | kJ/mol | N/A | Hunter and Lias, 1998 |

Ion clustering data

Data compiled by: Michael M. Meot-Ner (Mautner) and Sharon G. Lias
Clustering reactions
By formula: C14H24N+ + C14H23N = (C14H24N+ • C14H23N)
Free energy of reaction
ΔrG° (kJ/mol) | T (K) | Method | Reference | Comment |
---|---|---|---|---|
46.9 | 500. | PHPMS | Sunner, Kulatunga, et al., 1986 | gas phase |

References

Aldrich Chemical Company Inc., 1990
Aldrich Chemical Company Inc.,
Catalog Handbook of Fine Chemicals, Aldrich Chemical Company, Inc., Milwaukee WI, 1990, 1. [all data]
Frinton Laboratories Inc., 1986
Frinton Laboratories Inc.,
Catalog Number 11, Frinton Laboratories Inc., Vineland, NJ, 1986, 99. [all data]
Sunner, Kulatunga, et al., 1986
Sunner, J.A.; Kulatunga, R.; Kebarle, P.,
Fast Atom Bombardment Mass Spectrometry and Gas Phase Basicities,
Anal. Chem., 1986, 58, 7, 1312, https://doi.org/10.1021/ac00298a010
. [all data]
Hunter and Lias, 1998
Hunter, E.P.; Lias, S.G.,
Evaluated Gas Phase Basicities and Proton Affinities of Molecules: An Update,
J. Phys. Chem. Ref. Data, 1998, 27, 3, 413-656, https://doi.org/10.1063/1.556018
. [all data]