Ethanol-d1
- Formula: C2H5DO
- Molecular weight: 47.0746
- IUPAC Standard InChIKey: LFQSCWFLJHTTHZ-MICDWDOJSA-N
- CAS Registry Number: 1624-36-8
- Chemical structure:
View 3d structure (requires JavaScript / HTML 5) - Isotopologues:

Condensed phase thermochemistry data

Data compiled by: Eugene S. Domalski and Elizabeth D. Hearing
Constant pressure heat capacity of liquid
Cp,liquid (J/mol*K) | Temperature (K) | Reference | Comment |
---|---|---|---|
102.09 | 250. | Nikolaev, Rabinovich, et al., 1967 | T = 80 to 250 K. |
116.23 | 298. | Rabinovich and Nikolaev, 1962 | T = 15 to 55°C. |

Phase change data

Data compiled by: Eugene S. Domalski and Elizabeth D. Hearing
Enthalpy of phase transition
ΔHtrs (kJ/mol) | Temperature (K) | Initial Phase | Final Phase | Reference | Comment |
---|---|---|---|---|---|
3.347 | 113.3 | crystaline, II | crystaline, I | Nikolaev, Rabinovich, et al., 1967 | |
4.310 | 156.9 | crystaline, I | liquid | Nikolaev, Rabinovich, et al., 1967 |
Entropy of phase transition
ΔStrs (J/mol*K) | Temperature (K) | Initial Phase | Final Phase | Reference | Comment |
---|---|---|---|---|---|
29.54 | 113.3 | crystaline, II | crystaline, I | Nikolaev, Rabinovich, et al., 1967 | |
27.47 | 156.9 | crystaline, I | liquid | Nikolaev, Rabinovich, et al., 1967 |

References

Nikolaev, Rabinovich, et al., 1967
Nikolaev, P.N.; Rabinovich, I.B.; Lebedev, B.V.,
Specific heat of H- and D-ethyl alcohol in the interval 80-250K,
Zhur. Fiz. Khim., 1967, 41, 1294-1299. [all data]
Rabinovich and Nikolaev, 1962
Rabinovich, I.B.; Nikolaev, P.N.,
Isotopic effect in the specific heat of some deutero compounds,
Dokl. Akad. Nauk, 1962, SSSR 142, 1335-1338. [all data]