Flunitrazepam
- Formula: C16H12FN3O3
- Molecular weight: 313.2832
- IUPAC Standard InChIKey: PPTYJKAXVCCBDU-UHFFFAOYSA-N
- CAS Registry Number: 1622-62-4
- Chemical structure:
View 3d structure (requires JavaScript / HTML 5) - Other names: 2H-1,4-Benzodiazepin-2-one, 5-(2-fluorophenyl)-1,3-dihydro-1-methyl-7-nitro-; 2H-1,4-Benzodiazepin-2-one, 1,3-dihydro-5-(2-fluorophenyl)-1-methyl-7-nitro-; 1,3-Dihydro-5-(o-fluorophenyl)-1-methyl-7-nitro-2H-1,4-benzodiazepin-2-one; 1-Methyl-7-nitro-5-(2-fluorophenyl)-3H-1,4-benzodiazepin-2(1H)-one; Narcozep; Ro 5-4200; Rohypnol; 5-(o-Fluorophenyl)-1,3-dihydro-1-methyl-7-nitro-2H-1,4-benzodiazepin-2-one; Roipnol; 5-(2-Fluorophenyl)-1-methyl-7-nitro-1,3-dihydrobenzo[e][1,4]diazepin-2-one; 5-(2-Fluorophenyl)-1-methyl-7-nitro-1,3-dihydro-2H-1,4-benzodiazepin-2-one

Kovats' RI, non-polar column, isothermal

Column type | Active phase | Temperature (C) | I | Reference | Comment |
---|---|---|---|---|---|
Capillary | SE-30 | 250. | 2600. | Dimov and Moskovkina, 1991 | |
Capillary | BP-1 | 250. | 2633. | Japp, Garthwaite, et al., 1988 | 25. m/0.22 mm/0.25 μm, N2 |
Capillary | DB-1 | 250. | 2600. | Japp, Garthwaite, et al., 1988 | 30. m/0.53 mm/1.5 μm, N2 |
Packed | SE-30 | 240. | 2571. | Musumarra, Scarlata, et al., 1987 | N2, 1% se-30 on Anachrom ABS(80-100mesh); Column length: 2. m |
Capillary | SPB-1 | 250. | 2610. | Lora-Tamayo, Rams, et al., 1986 | He; Column length: 25. m; Column diameter: 0.20 mm |
Packed | SE-30 | 250. | 2646. | Schütz, 1982 | N2 |
Packed | SE-30 | 250. | 2645. | Schuetz and Westenberger, 1979 | N2, Chromosorb G AW DMCS (80-100 mesh); Column length: 1.5 m |

Van Den Dool and Kratz RI, non-polar column, temperature ramp

Column type | Active phase | I | Reference | Comment |
---|---|---|---|---|
Capillary | VF-5MS | 2712.7 | Tretyakov, 2014 | 30. m/0.25 mm/0.25 μm, He; Tstart: 60. C; Tend: 270. C |
Capillary | CBP-1 | 2594. | Oyama, Sano, et al., 1987 | N2, 6. K/min; Column length: 12. m; Column diameter: 0.53 mm; Tstart: 120. C; Tend: 250. C |
Capillary | DB-1 | 2572. | Perrigo, Peel, et al., 1985 | 15. m/0.32 mm/0.25 μm, He, 8. K/min, 280. C @ 5. min; Tstart: 120. C |
Capillary | DB-1 | 2572. | Perrigo, Ballantyne, et al., 1984 | 15. m/0.25 mm/0.25 μm, He, 8. K/min, 280. C @ 5. min; Tstart: 120. C |

Normal alkane RI, non-polar column, temperature ramp

Column type | Active phase | I | Reference | Comment |
---|---|---|---|---|
Packed | SE-30 | 2645. | MHA, 9999 | Nitrogen, Chromosorb G AW DMCS (80-100 mesh); Column length: 2. m; Tstart: 100. C; Tend: 300. C |
Capillary | BP-1 | 2633. | MHA, 9999 | Tstart: 100. C; Tend: 300. C |
Capillary | DB-5 | 2633. | Zamechnik, Ethier, et al., 1989 | 15. m/0.25 mm/0.25 μm, He, 150. C @ 1. min, 10. K/min; Tend: 260. C |
Packed | SE-30 | 2607. | Chiarotti, de Giovanni, et al., 1986 | He, Chromosorb W(100-120 mesh), 200. C @ 2. min, 4. K/min, 285. C @ 10. min; Column length: 2. m |

Normal alkane RI, non-polar column, custom temperature program

Column type | Active phase | I | Reference | Comment |
---|---|---|---|---|
Capillary | SPB-1 | 2577. | Chiarotti, de Giovanni, et al., 1986 | He, Chromosorb W(100-120 mesh); Column length: 25. m; Phase thickness: 0.4 μm |
Other | Methyl Silicone | 2645. | Ardrey and Moffat, 1981 | Program: not specified |

References

Dimov and Moskovkina, 1991
Dimov, N.; Moskovkina, M.,
New aspects of quantitative structure-retention relationships in chromatography,
J. Chromatogr., 1991, 552, 59-69, https://doi.org/10.1016/S0021-9673(01)95923-0
. [all data]
Japp, Garthwaite, et al., 1988
Japp, M.; Garthwaite, K.; Geeson, A.V.; Osselton, M.D.,
Collection of Analytical Data for Benzodiazepines and Benzophenones,
J. Chromatogr., 1988, 439, 2, 317-339, https://doi.org/10.1016/S0021-9673(01)83844-9
. [all data]
Musumarra, Scarlata, et al., 1987
Musumarra, G.; Scarlata, G.; Romano, G.; Cappello, G.; Clementi, S.; Giulietti, G.,
Qualitative organic analysis. Part 2. Identification of drugs by principal components analysis of standardized TLC data in four eluent systems and of retention indices on SE 30,
J. Anal. Toxicol., 1987, 11, 4, 154-163, https://doi.org/10.1093/jat/11.4.154
. [all data]
Lora-Tamayo, Rams, et al., 1986
Lora-Tamayo, C.; Rams, M.A.; Chacon, J.M.R.,
Gas Chromatographic Data for 187 Nitrogen- or Phosphorus-Containing Drugs and Metabolites of Toxicological Interest Analysed on Methyl Silicone Capillary Columns,
J. Chromatogr., 1986, 374, 73-85, https://doi.org/10.1016/S0378-4347(00)83254-5
. [all data]
Schütz, 1982
Schütz, H.,
Benzodiazepines, Springer-Verlag, New York, 1982, 438. [all data]
Schuetz and Westenberger, 1979
Schuetz, H.; Westenberger, V.,
Gas chromatographic data of 31 benzodiazepines and metabolites,
J. Chromatogr., 1979, 169, 409-411, https://doi.org/10.1016/0021-9673(75)85071-0
. [all data]
Tretyakov, 2014
Tretyakov, K.V.,
Retention Data. NIST Mass Spectrometry Data Center., NIST Mass Spectrometry Data Center, 2014. [all data]
Oyama, Sano, et al., 1987
Oyama, N.; Sano, T.; Syoyama, M.; Maeda, K.,
Studies on systematic analysis of poisonous compounds in forensic chemistry. II. Application of capillary column gas chromatography to substance identification by means of retention indices,
Eisei Kagaku, 1987, 33, 5, 342-348, https://doi.org/10.1248/jhs1956.33.342
. [all data]
Perrigo, Peel, et al., 1985
Perrigo, B.J.; Peel, H.W.; Ballantyne, D.J.,
Use of Dual-Column Fused-Silica Capillary Gas Chromatography in Combination with Detector Response Factors for Analytical Toxicology.,
J. Chromatogr., 1985, 341, 81-88, https://doi.org/10.1016/S0378-4347(00)84011-6
. [all data]
Perrigo, Ballantyne, et al., 1984
Perrigo, B.J.; Ballantyne, D.J.; Peel, H.W.,
Condierations in developing a data base for drugs on a DBI capillary column,
J. Can. Soc. Forensic Sci., 1984, 17, 2, 41-49, https://doi.org/10.1080/00085030.1984.10757360
. [all data]
MHA, 9999
MHA, Directorate of ForensicScience.,
Forensic Toxicology, 9999. [all data]
Zamechnik, Ethier, et al., 1989
Zamechnik, J.; Ethier, J.-C.; Neville, G.A.,
Benzodiazepines- an extensive collection of mass spectra,
J. Can. Soc. Forensic Sci., 1989, 22, 3, 233-259, https://doi.org/10.1080/00085030.1989.10757437
. [all data]
Chiarotti, de Giovanni, et al., 1986
Chiarotti, M.; de Giovanni, N.; Fiori, A.,
Analysis of Benzodiazepines. I. Chromatographic Identification,
J. Chromatogr., 1986, 358, 169-178, https://doi.org/10.1016/S0021-9673(01)90326-7
. [all data]
Ardrey and Moffat, 1981
Ardrey, R.E.; Moffat, A.C.,
Gas-liquid chromatographic retention indices of 1318 substances of toxicological interest on SE-30 or OV-1 stationary phase,
J. Chromatogr., 1981, 220, 3, 195-252, https://doi.org/10.1016/S0021-9673(00)81925-1
. [all data]