5-Ethylidene-2-norbornene
- Formula: C9H12
- Molecular weight: 120.1916
- IUPAC Standard InChIKey: OJOWICOBYCXEKR-KRXBUXKQSA-N
- CAS Registry Number: 16219-75-3
- Chemical structure:
View 3d structure (requires JavaScript / HTML 5) - Species with the same structure:
- Stereoisomers:
- Other names: Bicyclo[2.2.1]hept-2-ene, 5-ethylidene-; 2-Norbornene, 5-ethylidene-; Ethylidenenorbornene; 5-Ethylidenebicyclo[2.2.1]hept-2-ene; Ethylidene-2-norbornene; 5-Ethylidenebicyclo[2.2.1]-2-heptene; 5-ethylidene-8,9,10-trinorborn-2-ene

Phase change data

Data compiled by: Robert L. Brown and Stephen E. Stein
Quantity | Value | Units | Method | Reference | Comment |
---|---|---|---|---|---|
Tboil | 419.2 | K | N/A | Aldrich Chemical Company Inc., 1990 |

Kovats' RI, non-polar column, isothermal

Column type | Active phase | Temperature (C) | I | Reference | Comment |
---|---|---|---|---|---|
Capillary | BP-1 | 100. | 916. | Bermejo, Blanco, et al., 1987 | N2; Column length: 12. m; Column diameter: 0.22 mm |
Capillary | BP-1 | 80. | 911. | Bermejo, Blanco, et al., 1987 | N2; Column length: 12. m; Column diameter: 0.22 mm |
Capillary | OV-101 | 100. | 915. | Bermejo, Blanco, et al., 1987 | N2; Column length: 25. m; Column diameter: 0.23 mm |
Capillary | OV-101 | 80. | 910. | Bermejo, Blanco, et al., 1987 | N2; Column length: 25. m; Column diameter: 0.23 mm |
Capillary | SE-30 | 70. | 908.2 | Tóth, 1983 | N2; Column length: 15. m; Column diameter: 0.25 mm |

Kovats' RI, polar column, isothermal

Column type | Active phase | Temperature (C) | I | Reference | Comment |
---|---|---|---|---|---|
Capillary | PEG-20M | 70. | 1106.8 | Tóth, 1983 | N2; Column length: 30. m; Column diameter: 0.3 mm |

Van Den Dool and Kratz RI, non-polar column, temperature ramp

Column type | Active phase | I | Reference | Comment |
---|---|---|---|---|
Capillary | DB-5 | 921.2 | Xu, van Stee, et al., 2003 | 30. m/0.25 mm/1. μm, He, 2.5 K/min; Tstart: 50. C; Tend: 200. C |

Normal alkane RI, non-polar column, custom temperature program

Column type | Active phase | I | Reference | Comment |
---|---|---|---|---|
Capillary | Squalane | 895. | Chen, 2008 | Program: not specified |
Capillary | OV-101 | 904. | Zenkevich, 1998 | He; Column length: 25. m; Column diameter: 0.20 mm; Program: not specified |
Capillary | OV-101 | 907. | Zenkevich, 1998 | He; Column length: 25. m; Column diameter: 0.20 mm; Program: not specified |

References

Aldrich Chemical Company Inc., 1990
Aldrich Chemical Company Inc.,
Catalog Handbook of Fine Chemicals, Aldrich Chemical Company, Inc., Milwaukee WI, 1990, 1. [all data]
Bermejo, Blanco, et al., 1987
Bermejo, J.; Blanco, C.G.; Diez, M.A.; Guillén, M.D.,
Kováts retention indices of selected mono and polycyclic olefins,
J. Hi. Res. Chromatogr. Chromatogr. Comm., 1987, 10, 8, 461-463, https://doi.org/10.1002/jhrc.1240100809
. [all data]
Tóth, 1983
Tóth, T.,
Use of capillary gas chromatography in collecting retention and chemical information for the analysis of complex petrochemical mixtures,
J. Chromatogr., 1983, 279, 157-165, https://doi.org/10.1016/S0021-9673(01)93614-3
. [all data]
Xu, van Stee, et al., 2003
Xu, X.; van Stee, L.L.P.; Williams, J.; Beens, J.; Adahchour, M.; Vreuls, R.J.J.; Brinkman, U.A.Th.; Lelieveld, J.,
Comprehensive two-dimensional gas chromatography (GC×GC) measurements of volatile organic compounds in the atmosphere,
Atmos. Chem. Phys., 2003, 3, 3, 665-682, https://doi.org/10.5194/acp-3-665-2003
. [all data]
Chen, 2008
Chen, H.-F.,
Quantitative prediction of gas chromatography retention indices with support vector machines, radial basis neutral networks and multiple linear regression,
Anal. Chim. Acta, 2008, 609, 1, 24-36, https://doi.org/10.1016/j.aca.2008.01.003
. [all data]
Zenkevich, 1998
Zenkevich, I.G.,
Application of Methods of Molecular Dynamics in Chromato-Spectral Identification of ISomeric Products of Organic reactions (in Russian),
Zh. Org. Khim., 1998, 34, 10, 1463-1470. [all data]