2,5-Dimethylbenzyl cyanide
- Formula: C10H11N
- Molecular weight: 145.2010
- IUPAC Standard InChIKey: HCELORQTHSKCQL-UHFFFAOYSA-N
- CAS Registry Number: 16213-85-7
- Chemical structure:
View 3d structure (requires JavaScript / HTML 5) - Other names: 2,5-Xylylacetonitrile; 2,5-Dimethylphenylacetonitrile; Benzeneacetonitrile, 2,5-dimethyl-; Acetonitrile, (2,5-xylyl)-

Condensed phase thermochemistry data

Data compiled by: Hussein Y. Afeefy, Joel F. Liebman, and Stephen E. Stein
Quantity | Value | Units | Method | Reference | Comment |
---|---|---|---|---|---|
ΔfH°liquid | 46. | kJ/mol | Ccb | Zavoianu, Contineanu, et al., 1987 | |
Quantity | Value | Units | Method | Reference | Comment |
ΔcH°liquid | -5563. | kJ/mol | Ccb | Zavoianu, Contineanu, et al., 1987 |

Phase change data

Data compiled by: Thermodynamics Research Center, NIST Boulder Laboratories, Chris Muzny director
Quantity | Value | Units | Method | Reference | Comment |
---|---|---|---|---|---|
Tfus | 301. | K | N/A | Akin, Stamatoff, et al., 1937 | Uncertainty assigned by TRC = 3. K |

References

Zavoianu, Contineanu, et al., 1987
Zavoianu, D.; Contineanu, I.; Moga-Gheorghe, S.; Marchidan, D.I.,
Structure and reactivity of nitriles. II. Condensing reactions of methyl and dimethylphenylacetonitriles with substituted aromatic aldehydes,
Rev. Chim. (Bucharest), 1987, 38, 9-15. [all data]
Akin, Stamatoff, et al., 1937
Akin, R.B.; Stamatoff, G.S.; Bogert, M.T.,
The Synthesis of 1,4-Dimethylphenanthrene by the Pschorr Reaction, and the Nonidentity of the Product with the 1,4-Dimethylphenanthrene of Bardhan nd Sengupta,
J. Am. Chem. Soc., 1937, 59, 1268. [all data]