1-Amino-1-cyclopropylethane
- Formula: C5H11N
- Molecular weight: 85.1475
- IUPAC Standard InChIKey: IXCXVGWKYIDNOS-UHFFFAOYSA-N
- CAS Registry Number: 1621-24-5
- Chemical structure:
View 3d structure (requires JavaScript / HTML 5) - Permanent link for this species. Use this link for bookmarking this species for future reference.

Condensed phase thermochemistry data

Data compiled by: Hussein Y. Afeefy, Joel F. Liebman, and Stephen E. Stein
Quantity | Value | Units | Method | Reference | Comment |
---|---|---|---|---|---|
ΔcH°liquid | -3478. | kJ/mol | Ccb | Zubova, 1901 |

References

Zubova, 1901
Zubova, P.,
Data about heat of combustion of compound cycle structure,
Zh. Fiz. Khim., 1901, 33, 708-722. [all data]