Phenol, 4,4'-[thiobis(methylene)]bis[2,6-bis(1,1-dimethylethyl)-
- Formula: C30H46O2S
- Molecular weight: 470.750
- IUPAC Standard InChIKey: UDFARPRXWMDFQU-UHFFFAOYSA-N
- CAS Registry Number: 1620-93-5
- Chemical structure:
View 3d structure (requires JavaScript / HTML 5) - Other names: α,α'-thiobis(2,6-di-tert-butyl-p-cresol); bis-[3,5-di-tert-butyl-4-hydroxybenzyl]sulfide

Phase change data

Data compiled as indicated in comments:
TRC - Thermodynamics Research Center, NIST Boulder Laboratories, Chris Muzny director
AC - William E. Acree, Jr., James S. Chickos
Quantity | Value | Units | Method | Reference | Comment |
---|---|---|---|---|---|
Tfus | 417.2 | K | N/A | Inozemtsev, Liakumovich, et al., 1972 | Uncertainty assigned by TRC = 0.5 K; TRC |
Enthalpy of fusion
ΔfusH (kJ/mol) | Temperature (K) | Method | Reference | Comment |
---|---|---|---|---|
43.1 | 417.2 | DTA | Inozemtsev, Liakumovich, et al., 1972 | AC |

References

Inozemtsev, Liakumovich, et al., 1972
Inozemtsev, P.P.; Liakumovich, A.G.; Gracheva, Z.D.,
Russ. J. Phys. Chem., 1972, 46, 6, 914. [all data]