Propanedioic acid, dimethyl-, diethyl ester
- Formula: C9H16O4
- Molecular weight: 188.2209
- IUPAC Standard InChIKey: UELKSYXXNGHTSE-UHFFFAOYSA-N
- CAS Registry Number: 1619-62-1
- Chemical structure:
View 3d structure (requires JavaScript / HTML 5) - Other names: Malonic acid, dimethyl-, diethyl ester; Diethyl dimethylmalonate

Phase change data

Data compiled as indicated in comments:
BS - Robert L. Brown and Stephen E. Stein
TRC - Thermodynamics Research Center, NIST Boulder Laboratories, Chris Muzny director
Quantity | Value | Units | Method | Reference | Comment |
---|---|---|---|---|---|
Tboil | 465.2 | K | N/A | Aldrich Chemical Company Inc., 1990 | BS |
Tboil | 470.2 | K | N/A | Weast and Grasselli, 1989 | BS |
Quantity | Value | Units | Method | Reference | Comment |
Tfus | 242.75 | K | N/A | Timmermans, 1952 | Uncertainty assigned by TRC = 0.5 K; TRC |

References

Aldrich Chemical Company Inc., 1990
Aldrich Chemical Company Inc.,
Catalog Handbook of Fine Chemicals, Aldrich Chemical Company, Inc., Milwaukee WI, 1990, 1. [all data]
Weast and Grasselli, 1989
CRC Handbook of Data on Organic Compounds, 2nd Editon, Weast,R.C and Grasselli, J.G., ed(s)., CRC Press, Inc., Boca Raton, FL, 1989, 1. [all data]
Timmermans, 1952
Timmermans, J.,
Freezing points of organic compounds. VVI New determinations.,
Bull. Soc. Chim. Belg., 1952, 61, 393. [all data]