6-α(H)-Santonin
- Formula: C15H18O3
- Molecular weight: 246.3016
- IUPAC Standard InChIKey: XJHDMGJURBVLLE-YWGZHDIYSA-N
- CAS Registry Number: 1618-77-5
- Chemical structure:
View 3d structure (requires JavaScript / HTML 5) - Stereoisomers:

Condensed phase thermochemistry data

Data compiled by: Hussein Y. Afeefy, Joel F. Liebman, and Stephen E. Stein
Quantity | Value | Units | Method | Reference | Comment |
---|---|---|---|---|---|
ΔfH°solid | -585.0 ± 1.5 | kJ/mol | Ccb | Cocker, McMurry, et al., 1964 | |
Quantity | Value | Units | Method | Reference | Comment |
ΔcH°solid | -7890.2 ± 1.5 | kJ/mol | Ccb | Cocker, McMurry, et al., 1964 | Corresponding ΔfHºsolid = -584.92 kJ/mol (simple calculation by NIST; no Washburn corrections) |

References

Cocker, McMurry, et al., 1964
Cocker, W.; McMurry, T.B.H.; Frisch, M.A.; McAllister, T.; Mackle, H.,
Stabilities of some santonin derivatives,
Tetrahedron Lett., 1964, 23, 2235-2237. [all data]