Naphthalene, 2-ethyldecahydro-
- Formula: C12H22
- Molecular weight: 166.3031
- IUPAC Standard InChIKey: HLQZZLGOHWUHQM-UHFFFAOYSA-N
- CAS Registry Number: 1618-23-1
- Chemical structure:
View 3d structure (requires JavaScript / HTML 5) - Species with the same structure:
- Stereoisomers:
- Other names: β-Ethyldecalin; 2-Ethyldecalin, isomer 4; 2-Ethyldecalin, isomer 3; 2-Ethyldecalin, isomer 2; 2-Ethyldecalin, isomer 1

Condensed phase thermochemistry data

Data compiled as indicated in comments:
ALS - Hussein Y. Afeefy, Joel F. Liebman, and Stephen E. Stein
DH - Eugene S. Domalski and Elizabeth D. Hearing
Quantity | Value | Units | Method | Reference | Comment |
---|---|---|---|---|---|
ΔcH°liquid | -7495.0 | kJ/mol | Ccb | Gollis, Belenyessy, et al., 1962 | Mixed isomers; Corresponding ΔfHºliquid = -371.3 kJ/mol (simple calculation by NIST; no Washburn corrections); ALS |
Constant pressure heat capacity of liquid
Cp,liquid (J/mol*K) | Temperature (K) | Reference | Comment |
---|---|---|---|
292.5 | 313. | Gudinowicz, Campbell, et al., 1963 | T = 313 to 483 K.; DH |
290.4 | 311. | Gollis, Belenyessy, et al., 1962, 2 | Temperatures 100, 200, 300°F.; DH |

Phase change data

Data compiled by: Thermodynamics Research Center, NIST Boulder Laboratories, Chris Muzny director
Quantity | Value | Units | Method | Reference | Comment |
---|---|---|---|---|---|
Tboil | 495. | K | N/A | Levy, 1938 | Uncertainty assigned by TRC = 4. K |
Tboil | 494. | K | N/A | Levy, 1931 | Uncertainty assigned by TRC = 4. K |

Kovats' RI, non-polar column, isothermal

Column type | Active phase | Temperature (C) | I | Reference | Comment |
---|---|---|---|---|---|
Capillary | OV-1 | 150. | 1290. | Zhang, Chen, et al., 1997 | 25. m/0.2 mm/0.33 μm, N2 |
Capillary | OV-1 | 150. | 1258. | Zhang, Chen, et al., 1997 | 25. m/0.2 mm/0.33 μm, N2 |
Capillary | SE-30 | 130. | 1239. | Bredael, 1982 | Column length: 100. m; Column diameter: 0.5 mm |
Capillary | SE-30 | 150. | 1252. | Bredael, 1982 | Column length: 100. m; Column diameter: 0.5 mm |
Capillary | SE-30 | 130. | 1247. | Bredael, 1982 | Column length: 100. m; Column diameter: 0.5 mm |
Capillary | SE-30 | 150. | 1259. | Bredael, 1982 | Column length: 100. m; Column diameter: 0.5 mm |
Capillary | SE-30 | 130. | 1275. | Bredael, 1982 | Column length: 100. m; Column diameter: 0.5 mm |
Capillary | SE-30 | 150. | 1284. | Bredael, 1982 | Column length: 100. m; Column diameter: 0.5 mm |
Capillary | SE-30 | 130. | 1278. | Bredael, 1982 | Column length: 100. m; Column diameter: 0.5 mm |
Capillary | SE-30 | 150. | 1288. | Bredael, 1982 | Column length: 100. m; Column diameter: 0.5 mm |

References

Gollis, Belenyessy, et al., 1962
Gollis, M.H.; Belenyessy, L.I.; Gudzinowicz, B.J.; Koch, S.D.; Smith, J.O.; Wineman, R.J.,
Evaluation of pure hydrocarbons as jet fuels,
J. Chem. Eng. Data, 1962, 7, 331-316. [all data]
Gudinowicz, Campbell, et al., 1963
Gudinowicz, B.J.; Campbell, R.H.; Adams, J.S.,
Specific heat measurements of complex saturated hydrocarbons,
J. Chem. Eng. Data, 1963, 8, 201-214. [all data]
Gollis, Belenyessy, et al., 1962, 2
Gollis, M.H.; Belenyessy, L.I.; Gudzinowicz, B.J.; Koch, S.D.; Smith, J.O.; Wineman, R.J.,
Evaluations of pure hydrocarbons as Jet Fuels,
J. Chem. Eng. Data, 1962, 7, 311-316. [all data]
Levy, 1938
Levy, G.,
Ann. Chim. (Paris), 1938, 9, 5. [all data]
Levy, 1931
Levy, G.,
Beta-ethylnaphthalene and its hydrogenation products,
C. R. Hebd. Seances Acad. Sci., 1931, 192, 1397. [all data]