Ethane, 1-chloro-1-fluoro-
- Formula: C2H4ClF
- Molecular weight: 82.505
- IUPAC Standard InChIKey: YACLCMMBHTUQON-UHFFFAOYSA-N
- CAS Registry Number: 1615-75-4
- Chemical structure:
View 3d structure (requires JavaScript / HTML 5) - Other names: 1-Chloro-1-fluoroethane; 1-Chlorofluoroethane; Freon 151; Monochloromonofluoroethane

Gas phase thermochemistry data

Data compiled by: Hussein Y. Afeefy, Joel F. Liebman, and Stephen E. Stein
Quantity | Value | Units | Method | Reference | Comment |
---|---|---|---|---|---|
ΔfH°gas | -313.4 ± 2.5 | kJ/mol | Ccr | Kolesov and Papina, 1973 | Reanalyzed by Kolesov and Papina, 1983, Original value = -310. ± 3. kJ/mol |
Quantity | Value | Units | Method | Reference | Comment |
ΔcH°gas | -1244. ± 3. | kJ/mol | Ccr | Kolesov and Papina, 1973 |

Phase change data

Data compiled by: Thermodynamics Research Center, NIST Boulder Laboratories, Chris Muzny director
Quantity | Value | Units | Method | Reference | Comment |
---|---|---|---|---|---|
Tboil | 289.3 | K | N/A | Henne and Renoll, 1936 | Uncertainty assigned by TRC = 0.5 K |

References

Kolesov and Papina, 1973
Kolesov, V.P.; Papina, T.S.,
Standard enthalpy of formation of 1-chloro-1-fluoroethane,
Russ. J. Phys. Chem. (Engl. Transl.), 1973, 47, 1660-1661. [all data]
Kolesov and Papina, 1983
Kolesov, V.P.; Papina, T.S.,
Thermochemistry of Haloethanes,
Russ. Chem. Rev., 1983, 52, 425. [all data]
Henne and Renoll, 1936
Henne, A.L.; Renoll, M.W.,
J. Am. Chem. Soc., 1936, 58, 889. [all data]