trans-1-Chloropropene
- Formula: C3H5Cl
- Molecular weight: 76.525
- IUPAC Standard InChIKey: OWXJKYNZGFSVRC-NSCUHMNNSA-N
- CAS Registry Number: 16136-85-9
- Chemical structure:
View 3d structure (requires JavaScript / HTML 5) - Stereoisomers:
- Other names: 1-Propene, 1-chloro-, (E)-; Propene, 1-chloro-, (E)-; (E)-1-Chloro-1-propene; trans-1-Chloro-1-Propene; trans-1-Propenyl chloride; (E)-1-Propene, 1-chloro

Gas phase thermochemistry data

Data compiled by: Hussein Y. Afeefy, Joel F. Liebman, and Stephen E. Stein
Quantity | Value | Units | Method | Reference | Comment |
---|---|---|---|---|---|
ΔfH°gas | -12. | kJ/mol | Eqk | Alfassi, Golden, et al., 1973 | Isomerization reaction |

Phase change data

Data compiled as indicated in comments:
BS - Robert L. Brown and Stephen E. Stein
TRC - Thermodynamics Research Center, NIST Boulder Laboratories, Chris Muzny director
AC - William E. Acree, Jr., James S. Chickos
Quantity | Value | Units | Method | Reference | Comment |
---|---|---|---|---|---|
Tboil | 310.6 | K | N/A | Weast and Grasselli, 1989 | BS |
Tboil | 309.85 | K | N/A | Hatch and Alexander, 1949 | Uncertainty assigned by TRC = 1. K; TRC |
Tboil | 309.9 | K | N/A | Groll and Hearne. G., 1939 | Uncertainty assigned by TRC = 1. K; TRC |
Tboil | 37.40 | K | N/A | Timmermans, 1927 | Uncertainty assigned by TRC = 0.5 K; source of data not clear; TRC |
Enthalpy of vaporization
ΔvapH (kJ/mol) | Temperature (K) | Method | Reference | Comment |
---|---|---|---|---|
28.5 | 292. | N/A | Horstmann, Gardeler, et al., 2001 | Based on data from 277. to 340. K.; AC |
29.7 | 256. | A | Stephenson and Malanowski, 1987 | Based on data from 241. to 343. K. See also Dykyj, 1970.; AC |

Reaction thermochemistry data

Data compiled by: Hussein Y. Afeefy, Joel F. Liebman, and Stephen E. Stein
Individual Reactions
By formula: C3H5Cl = C3H5Cl
Quantity | Value | Units | Method | Reference | Comment |
---|---|---|---|---|---|
ΔrH° | -3. ± 0.27 | kJ/mol | Eqk | Shevtsova and Andreevskii, 1971 | gas phase; Heat of isomerization |
By formula: C3H5Cl = C3H5Cl
Quantity | Value | Units | Method | Reference | Comment |
---|---|---|---|---|---|
ΔrH° | 3.2 ± 0.1 | kJ/mol | Ciso | Abell and Adolf, 1969 | gas phase; HBr catalyst |

Normal alkane RI, non-polar column, temperature ramp

Column type | Active phase | I | Reference | Comment |
---|---|---|---|---|
Capillary | OV-101 | 510. | Zenkevich, 2005 | 25. m/0.20 mm/0.10 μm, N2/He, 6. K/min; Tstart: 50. C; Tend: 250. C |

References

Alfassi, Golden, et al., 1973
Alfassi, Z.B.; Golden, D.M.; Benson, S.W.,
The thermochemistry of the isomerization of 3-halopropenes (allyl halides) to 1-halopropenes; entropy and enthalpy of formation contribution of the Cd-(H)(X) group,
J. Chem. Thermodyn., 1973, 5, 411-420. [all data]
Weast and Grasselli, 1989
CRC Handbook of Data on Organic Compounds, 2nd Editon, Weast,R.C and Grasselli, J.G., ed(s)., CRC Press, Inc., Boca Raton, FL, 1989, 1. [all data]
Hatch and Alexander, 1949
Hatch, L.F.; Alexander, H.E.,
Allylic Chlorides V. Relative Reactivities with Sodium Ethoxide in Ethanol,
J. Am. Chem. Soc., 1949, 71, 1037. [all data]
Groll and Hearne. G., 1939
Groll, H.P.A.; Hearne. G.,
Ind. Eng. Chem., 1939, 31, 1530. [all data]
Timmermans, 1927
Timmermans, J.,
The Melting Point of Organic Substances,
Bull. Soc. Chim. Belg., 1927, 36, 502. [all data]
Horstmann, Gardeler, et al., 2001
Horstmann, Sven; Gardeler, Hergen; Fischer, Kai; Köster, Frank; Gmehling, Jürgen,
Vapor Pressure, Vapor-Liquid Equilibrium, and Excess Enthalpy Data for Compounds and Binary Subsystems of the Chlorohydrin Process for Propylene Oxide Production,
J. Chem. Eng. Data, 2001, 46, 2, 337-345, https://doi.org/10.1021/je000292j
. [all data]
Stephenson and Malanowski, 1987
Stephenson, Richard M.; Malanowski, Stanislaw,
Handbook of the Thermodynamics of Organic Compounds, 1987, https://doi.org/10.1007/978-94-009-3173-2
. [all data]
Dykyj, 1970
Dykyj, J.,
Petrochemica, 1970, 10, 2, 51. [all data]
Shevtsova and Andreevskii, 1971
Shevtsova, L.A.; Andreevskii, D.N.,
Cis-trans isomerization of 1-chloro-1-propene,
Izv. Vyssh. Uchebn. Zaved., Khim. Khim. Tekhnol., 1971, 15, 718-720. [all data]
Abell and Adolf, 1969
Abell, P.I.; Adolf, P.K.,
HBr catalyzed photoisomerization of allyl halides,
J. Chem. Thermodyn., 1969, 1, 333-338. [all data]
Zenkevich, 2005
Zenkevich, I.G.,
Experimentally measured retention indices., 2005. [all data]