1-Propene, 1-chloro-, (Z)-
- Formula: C3H5Cl
- Molecular weight: 76.525
- IUPAC Standard InChIKey: OWXJKYNZGFSVRC-IHWYPQMZSA-N
- CAS Registry Number: 16136-84-8
- Chemical structure:
- Other names: cis-1-Chloropropene; Propene, 1-chloro-, (Z)-; cis-1-Chloro-1-Propene; 1-Chloro-propene; (Z)-1-Chloro-1-propene; (Z)-1-Propene, 1-chloro

Phase change data

Data compiled as indicated in comments:
BS - Robert L. Brown and Stephen E. Stein
TRC - Thermodynamics Research Center, NIST Boulder Laboratories, Chris Muzny director
AC - William E. Acree, Jr., James S. Chickos
Quantity | Value | Units | Method | Reference | Comment |
---|---|---|---|---|---|
Tboil | 305.6 ± 0.7 | K | AVG | N/A | Average of 6 values; Individual data points |
Enthalpy of vaporization
ΔvapH (kJ/mol) | Temperature (K) | Method | Reference | Comment |
---|---|---|---|---|
27.9 | 291. | N/A | Horstmann, Gardeler, et al., 2001 | Based on data from 276. to 332. K.; AC |
29.2 | 252. | A | Stephenson and Malanowski, 1987 | Based on data from 237. to 338. K. See also Dykyj, 1970.; AC |

Reaction thermochemistry data

Data compiled by: Hussein Y. Afeefy, Joel F. Liebman, and Stephen E. Stein
Individual Reactions
By formula: C3H5Cl = C3H5Cl
Quantity | Value | Units | Method | Reference | Comment |
---|---|---|---|---|---|
ΔrH° | -3. ± 0.27 | kJ/mol | Eqk | Shevtsova and Andreevskii, 1971 | gas phase; Heat of isomerization |
By formula: C3H5Cl = C3H5Cl
Quantity | Value | Units | Method | Reference | Comment |
---|---|---|---|---|---|
ΔrH° | 3.2 ± 0.1 | kJ/mol | Ciso | Abell and Adolf, 1969 | gas phase; HBr catalyst |
By formula: C3H5Cl = C3H5Cl
Quantity | Value | Units | Method | Reference | Comment |
---|---|---|---|---|---|
ΔrH° | 15. ± 0.8 | kJ/mol | Eqk | Alfassi, Golden, et al., 1973 | liquid phase |

Normal alkane RI, non-polar column, temperature ramp

Column type | Active phase | I | Reference | Comment |
---|---|---|---|---|
Capillary | OV-101 | 498. | Zenkevich, 2005 | 25. m/0.20 mm/0.10 μm, N2/He, 6. K/min; Tstart: 50. C; Tend: 250. C |

Normal alkane RI, non-polar column, custom temperature program

Column type | Active phase | I | Reference | Comment |
---|---|---|---|---|
Capillary | OV-1, SE-30, Methyl silicone, SP-2100, OV-101, DB-1, etc. | 512. | Waggott and Davies, 1984 | Hydrogen; Column length: 50. m; Column diameter: 0.32 mm; Program: not specified |

Gas phase thermochemistry data

Data compiled by: Hussein Y. Afeefy, Joel F. Liebman, and Stephen E. Stein
Quantity | Value | Units | Method | Reference | Comment |
---|---|---|---|---|---|
ΔfH°gas | -15. | kJ/mol | Eqk | Alfassi, Golden, et al., 1973 |

References

Horstmann, Gardeler, et al., 2001
Horstmann, Sven; Gardeler, Hergen; Fischer, Kai; Köster, Frank; Gmehling, Jürgen,
Vapor Pressure, Vapor-Liquid Equilibrium, and Excess Enthalpy Data for Compounds and Binary Subsystems of the Chlorohydrin Process for Propylene Oxide Production,
J. Chem. Eng. Data, 2001, 46, 2, 337-345, https://doi.org/10.1021/je000292j
. [all data]
Stephenson and Malanowski, 1987
Stephenson, Richard M.; Malanowski, Stanislaw,
Handbook of the Thermodynamics of Organic Compounds, 1987, https://doi.org/10.1007/978-94-009-3173-2
. [all data]
Dykyj, 1970
Dykyj, J.,
Petrochemica, 1970, 10, 2, 51. [all data]
Shevtsova and Andreevskii, 1971
Shevtsova, L.A.; Andreevskii, D.N.,
Cis-trans isomerization of 1-chloro-1-propene,
Izv. Vyssh. Uchebn. Zaved., Khim. Khim. Tekhnol., 1971, 15, 718-720. [all data]
Abell and Adolf, 1969
Abell, P.I.; Adolf, P.K.,
HBr catalyzed photoisomerization of allyl halides,
J. Chem. Thermodyn., 1969, 1, 333-338. [all data]
Alfassi, Golden, et al., 1973
Alfassi, Z.B.; Golden, D.M.; Benson, S.W.,
The thermochemistry of the isomerization of 3-halopropenes (allyl halides) to 1-halopropenes; entropy and enthalpy of formation contribution of the Cd-(H)(X) group,
J. Chem. Thermodyn., 1973, 5, 411-420. [all data]
Zenkevich, 2005
Zenkevich, I.G.,
Experimentally measured retention indices., 2005. [all data]
Waggott and Davies, 1984
Waggott, A.; Davies, I.W.,
Identification of organic pollutants using linear temperature programmed retention indices (LTPRIs) - Part II, 1984, retrieved from http://dwi.defra.gov.uk/research/completed-research/reports/dwi0383.pdf. [all data]