CAS Reg. No. 161173-70-2
- CAS Registry Number: 161173-70-2

Reaction thermochemistry data

Data compiled by: John E. Bartmess
Individual Reactions
(CAS Reg. No. 161173-70-2 • 4294967295) +
= CAS Reg. No. 161173-70-2
By formula: (CAS Reg. No. 161173-70-2 • 4294967295Al) + Al = CAS Reg. No. 161173-70-2
Quantity | Value | Units | Method | Reference | Comment |
---|---|---|---|---|---|
ΔrH° | 40.2 ± 5.2 | kcal/mol | N/A | Nakajima, Taguwa, et al., 1995 | gas phase; Vertical Detachment Energy: 2.14±0.11 eV |

References

Nakajima, Taguwa, et al., 1995
Nakajima, A.; Taguwa, T.; Nakao, K.; Hoshino, K.; Iwata, S.; Kaya, K.,
Photoelectron Spectroscopy of AlnS1- Clusters (n=1-9),
J. Chem. Phys., 1995, 102, 2, 660, https://doi.org/10.1063/1.469178
. [all data]