2-Propanol, 1-phenoxy-3-(phenylamino)-
- Formula: C15H17NO2
- Molecular weight: 243.3010
- IUPAC Standard InChIKey: DSXTWXWHWLDHFS-UHFFFAOYSA-N
- CAS Registry Number: 16112-55-3
- Chemical structure:
View 3d structure (requires JavaScript / HTML 5) - Other names: 1-Anilino-3-phenoxy-2-propanol; N-(3-Phenoxy-2-hydroxypropyl)aniline

Gas phase thermochemistry data

Data compiled by: Hussein Y. Afeefy, Joel F. Liebman, and Stephen E. Stein
Quantity | Value | Units | Method | Reference | Comment |
---|---|---|---|---|---|
ΔfH°gas | -185. ± 3. | kJ/mol | Ccb | Kuznetsova, Miroshnichenko, et al., 1976 |

Condensed phase thermochemistry data

Data compiled by: Hussein Y. Afeefy, Joel F. Liebman, and Stephen E. Stein
Quantity | Value | Units | Method | Reference | Comment |
---|---|---|---|---|---|
ΔfH°solid | -298. ± 3. | kJ/mol | Ccb | Kuznetsova, Miroshnichenko, et al., 1976 | |
Quantity | Value | Units | Method | Reference | Comment |
ΔcH°solid | -8034. ± 3. | kJ/mol | Ccb | Kuznetsova, Miroshnichenko, et al., 1976 |

Phase change data

Data compiled as indicated in comments:
AC - William E. Acree, Jr., James S. Chickos
ALS - Hussein Y. Afeefy, Joel F. Liebman, and Stephen E. Stein
Enthalpy of vaporization
ΔvapH (kJ/mol) | Temperature (K) | Method | Reference | Comment |
---|---|---|---|---|
99.9 | 358. | A | Stephenson and Malanowski, 1987 | There is a problem with these experimental values; AC |
Enthalpy of sublimation
ΔsubH (kJ/mol) | Temperature (K) | Method | Reference | Comment |
---|---|---|---|---|
113.9 | 328. | A | Stephenson and Malanowski, 1987 | Based on data from 323. to 333. K.; AC |
114. ± 2. | 343. | V | Kuznetsova, Miroshnichenko, et al., 1976 | ALS |

Reaction thermochemistry data

Data compiled by: Hussein Y. Afeefy, Joel F. Liebman, and Stephen E. Stein
Individual Reactions
By formula: C15H17NO2 = C9H10O2 + C6H7N
Quantity | Value | Units | Method | Reference | Comment |
---|---|---|---|---|---|
ΔrH° | 113. ± 2. | kJ/mol | Cm | Kuznetsova, Rakova, et al., 1975 | solid phase; solvent: DMF |

References

Kuznetsova, Miroshnichenko, et al., 1976
Kuznetsova, V.P.; Miroshnichenko, E.A.; Zelenetskii, A.N.; Rakova, G.V.; Lebedev, Yu.A.; Enikolopyan, N.S.,
Enthalpies of reactions of epoxides with primary amines,
Dokl. Phys. Chem. (Engl. Transl.), 1976, 226, 147-150, In original 1109. [all data]
Stephenson and Malanowski, 1987
Stephenson, Richard M.; Malanowski, Stanislaw,
Handbook of the Thermodynamics of Organic Compounds, 1987, https://doi.org/10.1007/978-94-009-3173-2
. [all data]
Kuznetsova, Rakova, et al., 1975
Kuznetsova, V.P.; Rakova, G.V.; Miroshnichenko, E.A.; Lebedev, Yu.A.; Enikolopyan, N.S.,
Thermochemical study of the interaction of epoxy compounds with primary amines,
Dokl. Phys. Chem. (Engl. Transl.), 1975, 225, 1231-1234. [all data]