Methane, tricyclohexyl-
- Formula: C19H34
- Molecular weight: 262.4733
- IUPAC Standard InChIKey: SQDGPLNZHYWEOB-UHFFFAOYSA-N
- CAS Registry Number: 1610-24-8
- Chemical structure:
View 3d structure (requires JavaScript / HTML 5) - Other names: Tricyclohexylmethane; Cyclohexane, 1,1',1''-methylidynetris-

Phase change data

Data compiled as indicated in comments:
TRC - Thermodynamics Research Center, NIST Boulder Laboratories, Chris Muzny director
AC - William E. Acree, Jr., James S. Chickos
Quantity | Value | Units | Method | Reference | Comment |
---|---|---|---|---|---|
Tfus | 328.55 | K | N/A | Anonymous, 1968 | Uncertainty assigned by TRC = 0.5 K; TRC |
Tfus | 329. | K | N/A | Foehr and Fenske, 1949 | Uncertainty assigned by TRC = 3. K; TRC |
Tfus | 332.0 | K | N/A | Smith, Alderman, et al., 1949 | Uncertainty assigned by TRC = 2. K; TRC |
Tfus | 332.2 | K | N/A | Adkins, Zartman, et al., 1931 | Uncertainty assigned by TRC = 2. K; TRC |
Enthalpy of vaporization
ΔvapH (kJ/mol) | Temperature (K) | Method | Reference | Comment |
---|---|---|---|---|
81.4 | 348. | A | Stephenson and Malanowski, 1987 | Based on data from 333. to 365. K. See also Morecroft, 1964.; AC |
73.3 | 443. | A | Stephenson and Malanowski, 1987 | Based on data from 428. to 605. K.; AC |
Enthalpy of sublimation
ΔsubH (kJ/mol) | Temperature (K) | Reference | Comment |
---|---|---|---|
117.4 | 311. | Stephenson and Malanowski, 1987 | Based on data from 301. to 321. K. See also Morecroft, 1964.; AC |

References

Anonymous, 1968
Anonymous, R.,
Properties of hydrocarbon of high molecular weight, Am. Pet. Inst. Res. Proj. 42, Penn. State Univ., 1968. [all data]
Foehr and Fenske, 1949
Foehr, E.G.; Fenske, M.R.,
Magneto-optic Rotation of Hydrocarbons,
Ind. Eng. Chem., 1949, 41, 1956. [all data]
Smith, Alderman, et al., 1949
Smith, H.A.; Alderman, D.M.; Shacklett, C.D.; Welch, C.M.,
The Catalytic Hydrogenation of the Benzene Nucleus VI. The Hydrogenation of Compounds with Two Benzene Rings,
J. Am. Chem. Soc., 1949, 71, 3772. [all data]
Adkins, Zartman, et al., 1931
Adkins, H.; Zartman, W.H.; Cramer, H.,
The Hydrogention of Certain Branched Compounds Over Nickel,
J. Am. Chem. Soc., 1931, 53, 1425. [all data]
Stephenson and Malanowski, 1987
Stephenson, Richard M.; Malanowski, Stanislaw,
Handbook of the Thermodynamics of Organic Compounds, 1987, https://doi.org/10.1007/978-94-009-3173-2
. [all data]
Morecroft, 1964
Morecroft, D.W.,
Vapor Pressures of Some High Molecular Weight Hydrocarbons.,
J. Chem. Eng. Data, 1964, 9, 4, 488-490, https://doi.org/10.1021/je60023a003
. [all data]