Hexane, 1,6-dicyclohexyl-
- Formula: C18H34
- Molecular weight: 250.4626
- IUPAC Standard InChIKey: VBQJFJRTZSWYPK-UHFFFAOYSA-N
- CAS Registry Number: 1610-23-7
- Chemical structure:
View 3d structure (requires JavaScript / HTML 5) - Other names: Cyclohexane, 1,1'-(1,6-hexanediyl)bis-

Condensed phase thermochemistry data

Data compiled by: Hussein Y. Afeefy, Joel F. Liebman, and Stephen E. Stein
Quantity | Value | Units | Method | Reference | Comment |
---|---|---|---|---|---|
ΔcH°solid | -11560. | kJ/mol | Ccb | Serijan and Wise, 1951 | Corresponding ΔfHºsolid = -380. kJ/mol (simple calculation by NIST; no Washburn corrections) |

Phase change data

Data compiled as indicated in comments:
TRC - Thermodynamics Research Center, NIST Boulder Laboratories, Chris Muzny director
AC - William E. Acree, Jr., James S. Chickos
Quantity | Value | Units | Method | Reference | Comment |
---|---|---|---|---|---|
Tboil | 613.7 | K | N/A | Serijan and Wise, 1951, 2 | Uncertainty assigned by TRC = 0.6 K; TRC |
Quantity | Value | Units | Method | Reference | Comment |
Tfus | 283.36 | K | N/A | Serijan and Wise, 1951, 3 | Uncertainty assigned by TRC = 1. K; TRC |
Tfus | 283.36 | K | N/A | Serijan and Wise, 1951, 2 | Uncertainty assigned by TRC = 0.3 K; TRC |
Tfus | 280.1 | K | N/A | Boelhouwer, Nederbragt, et al., 1950 | Uncertainty assigned by TRC = 2. K; TRC |
Enthalpy of vaporization
ΔvapH (kJ/mol) | Temperature (K) | Method | Reference | Comment |
---|---|---|---|---|
85.9 | 303. | A | Stephenson and Malanowski, 1987 | Based on data from 288. to 373. K. See also Morecroft, 1964.; AC |

References

Serijan and Wise, 1951
Serijan, K.T.; Wise, P.H.,
Dicyclic hydrocarbons. IV. Synthesis and physical properties of α,α- and α,omega-diphenyl- and dicyclohexyl- pentanes and hexanes,
J. Am. Chem. Soc., 1951, 73, 5191-5193. [all data]
Serijan and Wise, 1951, 2
Serijan, K.T.; Wise, P.H.,
Dicyclic hydrocarboms. IV. Synthesis and Physical properties of alpha,alpha - and alpha,omega-diphenyl- and dicyclohexyl- pentanes and hexanes,
J. Am. Chem. Soc., 1951, 73, 5191. [all data]
Serijan and Wise, 1951, 3
Serijan, K.T.; Wise, P.H.,
, Natl. Advis. Comm. Aeronaut., Lewis Flight Propulsion Lab ., Cleveland, 1951. [all data]
Boelhouwer, Nederbragt, et al., 1950
Boelhouwer, J.W.M.; Nederbragt, G.W.; Verberg, G.W.,
Viscosity data of organic liquids,
Appl. Sci. Res., Sect. A, 1950, 2, 249. [all data]
Stephenson and Malanowski, 1987
Stephenson, Richard M.; Malanowski, Stanislaw,
Handbook of the Thermodynamics of Organic Compounds, 1987, https://doi.org/10.1007/978-94-009-3173-2
. [all data]
Morecroft, 1964
Morecroft, D.W.,
Vapor Pressures of Some High Molecular Weight Hydrocarbons.,
J. Chem. Eng. Data, 1964, 9, 4, 488-490, https://doi.org/10.1021/je60023a003
. [all data]