Prometon
- Formula: C10H17N5O
- Molecular weight: 223.2749
- IUPAC Standard InChIKey: ISEUFVQQFVOBCY-UHFFFAOYSA-N
- CAS Registry Number: 1610-18-0
- Chemical structure:
View 3d structure (requires JavaScript / HTML 5) - Other names: 1,3,5-Triazine-2,4-diamine, 6-methoxy-N,N'-bis(1-methylethyl)-; s-Triazine, 2,4-bis(isopropylamino)-6-methoxy-; G-31435; Gesafram; Methoxypropazine; Pramitol; Pramitol 5P; Prometone; 2-Methoxy-4,6-bis(isopropylamino)triazine; Gesafram 50; Ontracic 800; Ontrack; Ontrack-we-2; Primatol 25e; 2-Methoxy-4,6-bis(isopropylamino)-s-triazine; 2-Methoxy-4,6-bis(isopropylamino)-1,3,5-triazine; 2,4-Bis(isopropylamino)-6-methoxy-s-triazine; 2,6-Diisopropylamino-4-methoxytriazine; 4,6-Bis(isopropylamino)-2-methoxy-s-triazine; N,N'-Diisopropyl-6-methoxy-1,3,5-triazine-2,4-diyldiamine; 1,3,5-Triazine-2,4-diamine, 6-methoxy-N2,N4-bis(1-methylethyl)-; NSC 163048; (l) N-acetylaspartic acid, diethyl ester

Phase change data

Data compiled as indicated in comments:
TRC - Thermodynamics Research Center, NIST Boulder Laboratories, Chris Muzny director
AC - William E. Acree, Jr., James S. Chickos
Quantity | Value | Units | Method | Reference | Comment |
---|---|---|---|---|---|
Tfus | 364.35 | K | N/A | Donnelly, Drewes, et al., 1990 | Uncertainty assigned by TRC = 0.2 K; TRC |
Tfus | 364.6 | K | N/A | Plato and Glasgow, 1969 | Uncertainty assigned by TRC = 0.2 K; TRC |
Enthalpy of sublimation
ΔsubH (kJ/mol) | Temperature (K) | Method | Reference | Comment |
---|---|---|---|---|
92.2 | 338. | GS-GC | Stephenson and Malanowski, 1987 | Based on data from 323. to 365. K. See also Friedrich and Stammbach, 1964.; AC |
Enthalpy of fusion
ΔfusH (kJ/mol) | Temperature (K) | Method | Reference | Comment |
---|---|---|---|---|
21.18 | 363.5 | DSC | Acree, 1991 | See also Donnelly, Drewes, et al., 1990, 2.; AC |

Kovats' RI, polar column, isothermal

Column type | Active phase | Temperature (C) | I | Reference | Comment |
---|---|---|---|---|---|
Packed | Carbowax 20M | 215. | 2539. | Leclercq and Pacáková, 1979 | N2, Chromosorb W |
Packed | Carbowax 20M | 190. | 2570. | Matisová, Krupcík, et al., 1979 | N2, Chromosorb W AW (80-100 mesh); Column length: 1.3 m |
Packed | Carbowax 20M | 215. | 2539. | Pacáková and Nemec, 1978 | N2, Chromosorb W; Column length: 1.4 m |

Normal alkane RI, non-polar column, custom temperature program

Column type | Active phase | I | Reference | Comment |
---|---|---|---|---|
Capillary | Ultra-1 | 1704. | Tameo and Kiyos, 1991 | Program: not specified |

Normal alkane RI, polar column, custom temperature program

Column type | Active phase | I | Reference | Comment |
---|---|---|---|---|
Capillary | Carbowax 400, Carbowax 20M, Carbowax 1540, Carbowax 4000, Superox 06, PEG 20M, etc. | 2539. | Waggott and Davies, 1984 | Hydrogen; Column length: 50. m; Column diameter: 0.32 mm; Program: not specified |

References

Donnelly, Drewes, et al., 1990
Donnelly, J.R.; Drewes, L.A.; Johnson, R.L.; Munslow, W.D.; Knapp, K.K.; Sovocool, G.W.,
Purity and heat of fusion data for environmental standards as determined by differential scanning calorimetry,
Thermochim. Acta, 1990, 167, 2, 155, https://doi.org/10.1016/0040-6031(90)80476-F
. [all data]
Plato and Glasgow, 1969
Plato, C.; Glasgow, A.R., Jr.,
Differential scanning calorimetry as a general method for determining the purity and heat of fusion of high-purity organic chemicals. Application to 95 compounds,
Anal. Chem., 1969, 41, 2, 330, https://doi.org/10.1021/ac60271a041
. [all data]
Stephenson and Malanowski, 1987
Stephenson, Richard M.; Malanowski, Stanislaw,
Handbook of the Thermodynamics of Organic Compounds, 1987, https://doi.org/10.1007/978-94-009-3173-2
. [all data]
Friedrich and Stammbach, 1964
Friedrich, K.; Stammbach, K.,
Gas chromatographic determination of small vapour pressures determination of the vapour pressures of some triazine herbicides,
Journal of Chromatography A, 1964, 16, 22-28, https://doi.org/10.1016/S0021-9673(01)82436-5
. [all data]
Acree, 1991
Acree, William E.,
Thermodynamic properties of organic compounds: enthalpy of fusion and melting point temperature compilation,
Thermochimica Acta, 1991, 189, 1, 37-56, https://doi.org/10.1016/0040-6031(91)87098-H
. [all data]
Donnelly, Drewes, et al., 1990, 2
Donnelly, J.R.; Drewes, L.A.; Johnson, R.L.; Munslow, W.D.; Knapp, K.K.; Sovocool, G.W.,
Purity and heat of fusion data for environmental standards as determined by differential scanning calorimetry,
Thermochimica Acta, 1990, 167, 2, 155-187, https://doi.org/10.1016/0040-6031(90)80476-F
. [all data]