Oxirane, methyl-, (S)-
- Formula: C3H6O
- Molecular weight: 58.0791
- IUPAC Standard InChIKey: GOOHAUXETOMSMM-GSVOUGTGSA-N
- CAS Registry Number: 16088-62-3
- Chemical structure:
View 3d structure (requires JavaScript / HTML 5) - Stereoisomers:
- Other names: (S)-(-)-Propylene oxide; 1,2-Propylene oxide; (S)-1,2-epoxypropane

Phase change data

Data compiled by: Thermodynamics Research Center, NIST Boulder Laboratories, Chris Muzny director
Quantity | Value | Units | Method | Reference | Comment |
---|---|---|---|---|---|
Tboil | 307.9 | K | N/A | Price and Osgan, 1956 | Uncertainty assigned by TRC = 2. K |

References

Price and Osgan, 1956
Price, C.C.; Osgan, M.,
The Polymerization of l-Propylene Oxide,
J. Am. Chem. Soc., 1956, 78, 4787-4792. [all data]