Benzene, 1,4-bis(1-methylethenyl)-
- Formula: C12H14
- Molecular weight: 158.2396
- IUPAC Standard InChIKey: ZENYUPUKNXGVDY-UHFFFAOYSA-N
- CAS Registry Number: 1605-18-1
- Chemical structure:
View 3d structure (requires JavaScript / HTML 5) - Other names: Benzene, p-diisopropenyl-; p-Diisopropenylbenzene; 1,4-Bis(1-methylvinyl)benzene; 1,4-Diisopropenylbenzene

Phase change data

Data compiled by: Robert L. Brown and Stephen E. Stein
Quantity | Value | Units | Method | Reference | Comment |
---|---|---|---|---|---|
Tboil | 501. | K | N/A | Frinton Laboratories Inc., 1986 |

References

Frinton Laboratories Inc., 1986
Frinton Laboratories Inc.,
Catalog Number 11, Frinton Laboratories Inc., Vineland, NJ, 1986, 99. [all data]