2-hydroxyethyl nitrate
- Formula: C2H5NO4
- Molecular weight: 107.0654
- IUPAC Standard InChIKey: HTKIMWYSDZQQBP-UHFFFAOYSA-N
- CAS Registry Number: 16051-48-2
- Chemical structure:
View 3d structure (requires JavaScript / HTML 5) - Other names: 1,2-ethanediol, mononitrate

Reaction thermochemistry data

Data compiled by: Hussein Y. Afeefy, Joel F. Liebman, and Stephen E. Stein
Individual Reactions
By formula: C2H6O2 + HNO3 = C2H5NO4 + H2O
Quantity | Value | Units | Method | Reference | Comment |
---|---|---|---|---|---|
ΔrH° | -7.9 | kJ/mol | Cm | Tsvetkov, Sopin, et al., 1986 | liquid phase |

References

Tsvetkov, Sopin, et al., 1986
Tsvetkov, V.G.; Sopin, V.P.; Tsvetkova, L.Ya.; Marchenko, G.N.,
Enthalpy of reaction of nitric acid with some organic compounds,
J. Gen. Chem. USSR, 1986, 56, 471-474. [all data]