1-Dodecyn-3-ol, 3,7,11-trimethyl-
- Formula: C15H28O
- Molecular weight: 224.3822
- IUPAC Standard InChIKey: OWRXWSVBJIIORE-UHFFFAOYSA-N
- CAS Registry Number: 1604-35-9
- Chemical structure:
View 3d structure (requires JavaScript / HTML 5) - Other names: 3,7,11-trimethyldodecyn-3-ol; 3,7,11-Trimethyl-1-dodecyn-3-ol

Kovats' RI, non-polar column, isothermal

Column type | Active phase | Temperature (C) | I | Reference | Comment |
---|---|---|---|---|---|
Capillary | OV-101 | 170. | 1483. | Gribanova, Kharitonov, et al., 1990 | N2; Column length: 50. m; Column diameter: 0.26 mm |

Kovats' RI, polar column, isothermal

Column type | Active phase | Temperature (C) | I | Reference | Comment |
---|---|---|---|---|---|
Capillary | PEG-20M | 170. | 1927. | Gribanova, Kharitonov, et al., 1990, 2 | N2; Column length: 50. m; Column diameter: 0.27 mm |

Phase change data

Data compiled by: William E. Acree, Jr., James S. Chickos

Enthalpy of vaporization

ΔvapH (kJ/mol) Temperature (K) Reference Comment
43.2 ± 1.1463.Baglay, Gurariy, et al., 1988Based on data from 401. - 524. K. See also White, 1986.

References

Gribanova, Kharitonov, et al., 1990
Gribanova, S.V.; Kharitonov, Yu.Ya.; Dzhabarov, D.N.; Rudenko, B.A.; Yanotovskii, M.T.,
Gas-chromatographic identification of impurities in intermediate products of the synthesis of vitamin E based on the additive scheme of calculation of retention indices,
Zh. Anal. Khim., 1990, 45, 5, 1009-1016. [all data]
Gribanova, Kharitonov, et al., 1990, 2
Gribanova, S.V.; Kharitonov, Yu.Ya.; Dzhabarov, D.N.; Rudenko, B.A.; Yanotovskii, M.T.,
Investigation of the gas-chromatographic behaviour of intermediate products of vitamin E synthesis and their structural analogs on various stationary phases for the identification of impurities by their retention indices,
Zh. Anal. Khim., 1990, 45, 8, 1561-1567. [all data]