6-Methyl-3,5-heptadiene-2-one
- Formula: C8H12O
- Molecular weight: 124.1803
- IUPAC Standard InChIKey: KSKXSFZGARKWOW-UHFFFAOYSA-N
- CAS Registry Number: 1604-28-0
- Chemical structure:
View 3d structure (requires JavaScript / HTML 5) - Stereoisomers:
- Other names: 6-Methyl-3,5-heptadien-2-one; 6-Methyl-3,5-heptadienone-2; 3,5-Heptadien-2-one, 6-methyl-; 2-methyl-2,4-heptadien-6-one; 6-Methylhepta-3,5-dien-2-one; 6-Methyl-hepta-3,5-diene-2-one

Phase change data

Data compiled by: Robert L. Brown and Stephen E. Stein
Reduced pressure boiling point
Tboil (K) | Pressure (bar) | Reference |
---|---|---|
368. to 369. | 0.027 | Frinton Laboratories Inc., 1986 |

Kovats' RI, non-polar column, temperature ramp

Column type | Active phase | I | Reference | Comment |
---|---|---|---|---|
Capillary | HP-5MS | 1110. | Jalali-Heravi, Zekavat, et al., 2006 | 60. m/0.25 mm/0.25 μm, He, 40. C @ 1. min, 3. K/min, 250. C @ 20. min |
Capillary | DB-5 | 1088. | Mevy, Bessiere, et al., 2006 | 25. m/0.2 mm/0.15 μm, He, 60. C @ 3. min, 3. K/min; Tend: 220. C |

Van Den Dool and Kratz RI, non-polar column, temperature ramp

Column type | Active phase | I | Reference | Comment |
---|---|---|---|---|
Capillary | DB-Petro | 1074.9 | Pang T., Zhu S., et al., 2007 | 50. m/0.2 mm/0.5 μm, 2. K/min; Tstart: 50. C; Tend: 270. C |
Capillary | DB-Petro | 1074.9 | Pang T., Zhu S., et al., 2007 | 50. m/0.2 mm/0.5 μm, 2. K/min; Tstart: 50. C; Tend: 270. C |
Capillary | HP-5MS | 1106.9 | Zhao, Liang, et al., 2005 | 30. m/0.25 mm/0.25 μm, He, 2. K/min; Tstart: 80. C; Tend: 290. C |
Capillary | HP-5MS | 1106.5 | Zhao, Liang, et al., 2005 | 30. m/0.25 mm/0.25 μm, He, 4. K/min; Tstart: 80. C; Tend: 290. C |
Capillary | HP-5MS | 1106.3 | Zhao, Liang, et al., 2005 | 30. m/0.25 mm/0.25 μm, He, 6. K/min; Tstart: 80. C; Tend: 290. C |

Van Den Dool and Kratz RI, non-polar column, custom temperature program

Column type | Active phase | I | Reference | Comment |
---|---|---|---|---|
Capillary | HP-5MS | 1107.3 | Andriamaharavo, 2014 | 30. m/0.25 mm/0.25 μm, He; Program: 60C (1 min) => 5 C/min => 210C => 10 C/min => 280C (15 min) |

Van Den Dool and Kratz RI, polar column, temperature ramp

Column type | Active phase | I | Reference | Comment |
---|---|---|---|---|
Capillary | DB-Wax | 1582. | Shimoda, Shigematsu, et al., 1995 | 60. m/0.25 mm/0.25 μm, He, 2. K/min; Tstart: 50. C; Tend: 230. C |

Normal alkane RI, non-polar column, temperature ramp

Column type | Active phase | I | Reference | Comment |
---|---|---|---|---|
Capillary | HP-5 MS | 1107. | Radulovic, Blagojevic, et al., 2010 | 30. m/0.25 mm/0.25 μm, Helium, 5. K/min, 290. C @ 10. min; Tstart: 70. C |
Capillary | DB-5 | 1100. | Pino, Marbot, et al., 2006 | 30. m/0.25 mm/0.25 μm, Hydrogen, 70. C @ 4. min, 4. K/min; Tend: 280. C |
Capillary | DB-5 | 1105. | Pino, Marbot, et al., 2006 | 30. m/0.25 mm/0.25 μm, Hydrogen, 70. C @ 4. min, 4. K/min; Tend: 280. C |
Capillary | Optima-1 | 1084. | Brun, Bessière, et al., 2001 | 25. m/0.20 mm/0.25 μm, He, 50. C @ 3. min, 3. K/min; Tend: 250. C |
Capillary | Optima-1 | 1085. | de Beck, Bessière, et al., 2000 | 25. m/0.20 mm/0.25 μm, He, 50. C @ 3. min, 3. K/min; Tend: 250. C |
Capillary | DB-1 | 1074. | Buttery, Teranishi, et al., 1990 | He, 30. C @ 25. min, 4. K/min, 200. C @ 5. min; Column length: 60. m; Column diameter: 0.25 mm |
Capillary | DB-1 | 1076. | Habu, Flath, et al., 1985 | 3. K/min; Column length: 50. m; Column diameter: 0.32 mm; Tstart: 0. C; Tend: 250. C |
Capillary | DB-1 | 1073. | Habu, Flath, et al., 1985 | 3. K/min; Column length: 50. m; Column diameter: 0.32 mm; Tstart: 50. C; Tend: 250. C |
Capillary | DB-1 | 1086. | Habu, Flath, et al., 1985 | 3. K/min; Column length: 50. m; Column diameter: 0.32 mm; Tstart: 0. C; Tend: 250. C |
Capillary | DB-1 | 1083. | Habu, Flath, et al., 1985 | 3. K/min; Column length: 50. m; Column diameter: 0.32 mm; Tstart: 50. C; Tend: 250. C |

Normal alkane RI, non-polar column, custom temperature program

Column type | Active phase | I | Reference | Comment |
---|---|---|---|---|
Capillary | DB-1 | 1064. | Albano, Lima, et al., 2012 | 30. m/0.25 mm/0.25 μm, Hydrogen; Program: 45 0C 3 0C/min -> 175 0C 15 0C/min -> 300 0C (10 min) |
Capillary | SLB-5 MS | 1102. | Mondello, 2012 | 30. m/0.25 mm/0.25 μm, Helium; Program: not specified |
Capillary | SLB-5 MS | 1108. | Mondello, 2012 | 30. m/0.25 mm/0.25 μm, Helium; Program: not specified |
Capillary | Polydimethyl siloxane with 5 % Ph groups | 1107. | Robinson, Adams, et al., 2012 | Program: not specified |
Capillary | Polydimethyl siloxane with 5 % Ph groups | 1111. | Robinson, Adams, et al., 2012 | Program: not specified |
Capillary | DB-1 | 1076. | Ciccioli, Cecinato, et al., 1994 | 60. m/0.32 mm/0.25 μm; Program: not specified |
Capillary | DB-1 | 1076. | Ciccioli, Brancaleoni, et al., 1993 | 60. m/0.32 mm/0.25 μm; Program: 3 min at 5 C; 5 - 50 C at 3 deg/min; 50 - 220 C at 5 deg/min |

Normal alkane RI, polar column, temperature ramp

Column type | Active phase | I | Reference | Comment |
---|---|---|---|---|
Capillary | BP-20 | 1596. | Rawat, Gulati, et al., 2007 | 30. m/0.25 mm/0.25 μm, He, 70. C @ 4. min, 4. K/min, 220. C @ 5. min |
Capillary | Innowax | 1604. | Kaya, Baser, et al., 1999 | 60. m/0.25 mm/0.25 μm, He, 60. C @ 10. min; Tend: 220. C |
Capillary | Carbowax 20M | 1590. | Buttery, Parker, et al., 1981 | 50. C @ 30. min, 1. K/min; Column length: 150. m; Column diameter: 0.64 mm; Tend: 170. C |

Normal alkane RI, polar column, custom temperature program

Column type | Active phase | I | Reference | Comment |
---|---|---|---|---|
Capillary | Innowax FSC | 1602. | Baser, Demirci, et al., 2009 | 60. m/0.25 mm/0.25 μm, Helium; Program: 60 0C (10 min) 4 0C/min -> 220 0C (10 min) 1 0C/min -> 240 0C |
Capillary | HP-Innowax FSC | 1602. | Suleimenov Y.M., Atazhanova G.A., et al., 2006 | 60. m/0.25 mm/0.25 μm, He; Program: 60(10min) => 4C/min => 220C(10min) => 1C/min => 240C |
Capillary | HP Innowax FSP | 1602. | Altintas, Kose, et al., 2004 | 60. m/0.25 mm/0.25 μm, N2; Program: 60C(10min) => 4C/min => 220C(10min) => 1C/min => 240C |
Capillary | HP-Innowax FSC | 1602. | Klika, Demirci, et al., 2004 | 60. m/0.25 mm/0.25 μm, N2; Program: 60C(10min) => 4C/min => 220C(10min) => 1C/min => 240C |
Capillary | Innowax FSC | 1602. | Baser, Demirci, et al., 2003 | 60. m/0.25 mm/0.25 μm, He; Program: 60C(10min) => 4C/min => 220C (10min) => 1C/min => 240C |
Capillary | HP-Innowax FSC | 1602. | Demirci, Baser, et al., 2003 | 60. m/0.25 mm/0.25 μm, He; Program: 60C (10min) => 4C/min => 220C (10min) => 1C/min => 240C |
Capillary | HP Innowax FSP | 1602. | Tasdemir, Demirci, et al., 2003 | 60. m/0.25 mm/0.25 μm, He; Program: 60C(10min) => 4C/min => 220C (10min) => 1C/min => 240C |
Capillary | HP Innowax FSP | 1602. | Tasdemir, Demirci, et al., 2003 | 60. m/0.25 mm/0.25 μm, He; Program: 60C(10min) => 4C/min => 220C (10min) => 1C/min => 240C |
Capillary | HP-Innowax FSC | 1602. | Kivcak B., Mert T., et al., 2001 | 60. m/0.25 mm/0.25 μm, He; Program: 60C(10min) => 4C/min => 220C(10min) => 1C/min => 240C |
Capillary | Innowax FSC | 1602. | Saglam, Gozler, et al., 2001 | 60. m/0.25 mm/0.25 μm, He; Program: 60C(10min) => 4C/min => 220C(10min) => 1C/min => 240C |
Capillary | HP-Innowax | 1602. | Tabanca, Kirimer, et al., 2001 | 60. m/0.25 mm/0.25 μm, He; Program: 60C(10min) => 4C/min => 220C(10min) => 1C/min => 240C |
Capillary | Innowax | 1604. | Baser, Özek, et al., 2000 | 60. m/0.25 mm/0.25 μm, He; Program: 60 0C (10 min) 4 K/min -> 220 0C (10 min) 1 K/min -> 240 0C |
Capillary | Innowax | 1604. | Baser, Kürkcüoglu, et al., 1998 | 60. m/0.25 mm/0.25 μm; Program: 60C(10min) => 4C/min => 220C(10min) => 1C/min => 240C |

References

Frinton Laboratories Inc., 1986
Frinton Laboratories Inc.,
Catalog Number 11, Frinton Laboratories Inc., Vineland, NJ, 1986, 99. [all data]
Jalali-Heravi, Zekavat, et al., 2006
Jalali-Heravi, M.; Zekavat, B.; Sereshti, H.,
Characterization of essential oil components of Iranian geranium oil using gas chromatography-mass spectrometry combined with chemometric resolution techniques,
J. Chromatogr. A, 2006, 1114, 1, 154-163, https://doi.org/10.1016/j.chroma.2006.02.034
. [all data]
Mevy, Bessiere, et al., 2006
Mevy, J.-P.; Bessiere, J.-M.; Greff, S.; Zombre, G.; Viano, J.,
Composition of the volatile oil from the leaves of Ximenia americana L.,
Biochem. Syst. Ecol., 2006, 34, 7, 549-553, https://doi.org/10.1016/j.bse.2006.01.007
. [all data]
Pang T., Zhu S., et al., 2007
Pang T.; Zhu S.; Lu X.; Xu G.,
Identification of unknown compounds on the basis of retention index data in comprehensive two-dimensional gas chromatography,
J. Sep. Sci., 2007, 30, 6, 868-874, https://doi.org/10.1002/jssc.200600471
. [all data]
Zhao, Liang, et al., 2005
Zhao, C.-X.; Liang, Y.-Z.; Fang, H.-Z.; Li, X.-N.,
Temperature-programmed retention indices for gas chromatography-mass spectroscopy analysis of plant essential oils,
J. Chromatogr. A, 2005, 1096, 1-2, 76-85, https://doi.org/10.1016/j.chroma.2005.09.067
. [all data]
Andriamaharavo, 2014
Andriamaharavo, N.R.,
Retention Data. NIST Mass Spectrometry Data Center., NIST Mass Spectrometry Data Center, 2014. [all data]
Shimoda, Shigematsu, et al., 1995
Shimoda, M.; Shigematsu, H.; Shiratsuchi, H.; Osajima, Y.,
Comparison of volatile compounds among different grades of green tea and their relations to odor attributes,
J. Agric. Food Chem., 1995, 43, 6, 1621-1625, https://doi.org/10.1021/jf00054a038
. [all data]
Radulovic, Blagojevic, et al., 2010
Radulovic, N.; Blagojevic, P.; Palic, R.,
Comparative study of the leaf volatiles of Arctostaphylos uva-ursi (L.) Spreng. and Vaccinium vitis-idaea L. (Ericaceae),
Molecules, 2010, 15, 9, 6168-6185, https://doi.org/10.3390/molecules15096168
. [all data]
Pino, Marbot, et al., 2006
Pino, J.A.; Marbot, R.; Payo, A.; Chao, D.; Herrera, P.,
Aromatic Plants from Western Cuba VII. Composition of the Leaf Oil of Psidium wrightii KRug et Urb., Lantana involucrata L., Cinnamonum montanum (Sw.) Berchtold et J. Persl. and Caesalpinia violacea (Mill.) Standley,
J. Essent. Oil. Res., 2006, 18, 2, 170-174, https://doi.org/10.1080/10412905.2006.9699058
. [all data]
Brun, Bessière, et al., 2001
Brun, G.; Bessière, J.-M.; Dijoux-Franca, M.-G.; David, B.; Mariotte, A.-M.,
Volatile components of Catharanthus roseus (L.) G. Don (Apocynaceae),
Flavour Fragr. J., 2001, 16, 2, 116-119, https://doi.org/10.1002/ffj.958
. [all data]
de Beck, Bessière, et al., 2000
de Beck, P.O.; Bessière, J.M.; Dijoux-Franca, M.-G.; David, B.; Mariotte, A.-M.,
Volatile constituents from leaves and wood of Leea guineensis G. Don (Leeaceae) from Cameroon,
Flavour Fragr. J., 2000, 15, 3, 182-185, https://doi.org/10.1002/1099-1026(200005/06)15:3<182::AID-FFJ888>3.0.CO;2-X
. [all data]
Buttery, Teranishi, et al., 1990
Buttery, R.G.; Teranishi, R.; Ling, L.C.; Turnbaugh, J.G.,
Quantitative and sensory studies on tomato paste volatiles,
J. Agric. Food Chem., 1990, 38, 1, 336-340, https://doi.org/10.1021/jf00091a074
. [all data]
Habu, Flath, et al., 1985
Habu, T.; Flath, R.A.; Mon, T.R.; Morton, J.F.,
Volatile components of Rooibos tea (Aspalathus linearis),
J. Agric. Food Chem., 1985, 33, 2, 249-254, https://doi.org/10.1021/jf00062a024
. [all data]
Albano, Lima, et al., 2012
Albano, S.M.; Lima, A.S.; Miguel, M.G.; Pedro, L.G.; Barroso, J.G.; Figueiredo, A.C.,
Antioxidant, anti-5-lipoxygenase and antiacetylcholinesterase activities of essential oils and decoction water of some aromatic plants,
Rec. Nat. Prod., 2012, 6, 1, 35-48. [all data]
Mondello, 2012
Mondello, L.,
HS-SPME-GCxGC-MS analysis of Yerba Mate (Ilex paraguariensis)
in Shimadzu GC-GC application compendium of comprehensive 2D GC, Vol. 1-5, Shimadzu Corp., 2012, 1-29. [all data]
Robinson, Adams, et al., 2012
Robinson, A.L.; Adams, D.O.; Boss, P.K.; Heymann, H.; Solomon, P.S.; Trengove, R.D.,
Influence of geographic origine on the sensory characteristics and wine composition of Vitus viniferas cv. Cabernet Sauvignon wines from Australia (Supplemental data),
Am. J. Enol. Vitic., 2012, 64, 4, 467-476, https://doi.org/10.5344/ajev.2012.12023
. [all data]
Ciccioli, Cecinato, et al., 1994
Ciccioli, P.; Cecinato, A.; Brancaleoni, E.; Brachetti, A.; Frattoni, M.; Sparapani, R.,
Composition and Distribution of Polar and Non-Polar VOCs in Urban, Rural, Forest and Remote Areas,
Eur Commission EUR, 1994, 549-568. [all data]
Ciccioli, Brancaleoni, et al., 1993
Ciccioli, P.; Brancaleoni, E.; Cecinato, A.; Sparapani, R.; Frattoni, M.,
Identification and determination of biogenic and anthropogenic volatile organic compounds in forest areas of Northern and Southern Europe and a remote site of the Himalaya region by high-resolution gas chromatography-mass spectrometry,
J. Chromatogr., 1993, 643, 1-2, 55-69, https://doi.org/10.1016/0021-9673(93)80541-F
. [all data]
Rawat, Gulati, et al., 2007
Rawat, R.; Gulati, A.; Babu, G.D.K.; Acharya, R.; Kaul, V.K.; Singh, B.,
Characterization of volatile components of Kangra orthodox black tea by gas chromatography-mass spectrometry,
Food Chem., 2007, 105, 1, 229-235, https://doi.org/10.1016/j.foodchem.2007.03.071
. [all data]
Kaya, Baser, et al., 1999
Kaya, A.; Baser, K.H.C.; Demirci, B.; Koca, F.,
The essential oil of Acinos alpinus (L.) Moench growing in Turkey,
Flavour Fragr. J., 1999, 14, 1, 55-59, https://doi.org/10.1002/(SICI)1099-1026(199901/02)14:1<55::AID-FFJ784>3.0.CO;2-Q
. [all data]
Buttery, Parker, et al., 1981
Buttery, R.G.; Parker, F.D.; Teranishi, R.; Mon, T.R.; Ling, L.C.,
Volatile components of alfalfa leaf-cutter bee cells,
J. Agric. Food Chem., 1981, 29, 5, 955-958, https://doi.org/10.1021/jf00107a017
. [all data]
Baser, Demirci, et al., 2009
Baser, K.H.C.; Demirci, B.; Kurkcuoglu, M.; Satin, F.; Tumen, G.,
Comparative morphological and phytochemical charactertization of Salvia cadmica and S. smyrnaea,
Pak. J. Bot., 2009, 41, 4, 1545-1555. [all data]
Suleimenov Y.M., Atazhanova G.A., et al., 2006
Suleimenov Y.M.; Atazhanova G.A.; Ozek T.; Demirci B.; Kulyyasov A.T.; Adekenov S.M.; Baser K.H.C.,
Essential oil composition of three species of Achillea from Kazakhstan,
Chem. Nat. Compd. (Engl. Transl.), 2006, 37, 5, 447-450, https://doi.org/10.1023/A:1014471326724
. [all data]
Altintas, Kose, et al., 2004
Altintas, A.; Kose, Y.B.; Yucel, E.; Demirci, B.; Baser, K.H.C.,
Composition of the essential oil of Centaurea dichroa,
Chem. Nat. Compd. (Engl. Transl.), 2004, 40, 6, 604-605, https://doi.org/10.1007/s10600-005-0051-9
. [all data]
Klika, Demirci, et al., 2004
Klika, K.D.; Demirci, B.; Salminen, J.-P.; Ovcharenko, V.V.; Vuorela, S.; Baser, K.H.C.; Pihlaja, K.,
New, Sesquiterpenoid-Type Bicyclic Compounds from the Buds of Betula pubescens -- Ring-Contracted Products of β-Caryophyllene?,
Eur.J.Org.Chem., 2004, 2004, 12, 2627-2635, https://doi.org/10.1002/ejoc.200300808
. [all data]
Baser, Demirci, et al., 2003
Baser, K.H.C.; Demirci, B.; Dekebo, A.; Dagne, E.,
Essential oils of some Boswellia spp., myrrh and opopanax,
Flavour Fragr. J., 2003, 18, 2, 153-156, https://doi.org/10.1002/ffj.1166
. [all data]
Demirci, Baser, et al., 2003
Demirci, B.; Baser, K.H.C.; Yildiz, B.; Bahcecioglu, Z.,
Composition of the essential oils of six endemic Salvia spp. from Turkey,
Flavour Fragr. J., 2003, 18, 2, 116-121, https://doi.org/10.1002/ffj.1173
. [all data]
Tasdemir, Demirci, et al., 2003
Tasdemir, D.; Demirci, B.; Demirci, F.; Dönmez, A.A.; Baser, K.H.C.; Rüedi, P.,
Analysis of the Volatile Components of Five Turkish Rhododendron Species by Headspace Solid-Phase Microextraction and GC-MS (HS-SPME-GC-MS),
Z. Naturforsch., 2003, 58c, 797-803. [all data]
Kivcak B., Mert T., et al., 2001
Kivcak B.; Mert T.; Demirci B.; Baser K.H.C.,
Composition of the essential oil of Arbutus unedo,
Chem. Nat. Compd. (Engl. Transl.), 2001, 37, 5, 445-446, https://doi.org/10.1023/A:1014419309885
. [all data]
Saglam, Gozler, et al., 2001
Saglam, H.; Gozler, T.; Kivcak, B.; Demirci, B.; Baser, K.H.C.,
Volatile compounds from Haplophyllum myrtifolium,
Chem. Nat. Compd. (Engl. Transl.), 2001, 37, 5, 442-444, https://doi.org/10.1023/A:1014467225815
. [all data]
Tabanca, Kirimer, et al., 2001
Tabanca, N.; Kirimer, N.; Demirci, B.; Demirci, F.; Can Baser, K.H.,
Composition and antimicrobial activity of the essential oils of Micromeria cristata subsp. phrygia and the enantiomeric distribution of borneol,
J. Agric. Food Chem., 2001, 49, 9, 4300-4303, https://doi.org/10.1021/jf0105034
. [all data]
Baser, Özek, et al., 2000
Baser, K.H.C.; Özek, T.; Demirci, B.; Duman, H.,
Composition of the essential oil of Glaucosciadium cordifolium (Boiss.) Burtt et Davis from Turkey,
Flavour Fragr. J., 2000, 15, 1, 45-46, https://doi.org/10.1002/(SICI)1099-1026(200001/02)15:1<45::AID-FFJ867>3.0.CO;2-L
. [all data]
Baser, Kürkcüoglu, et al., 1998
Baser, K.H.C.; Kürkcüoglu, M.; Aytac, Z.,
Composition of the essential oil of Salvia euphratica Montbret ex Bentham var. euphratica from Turkey,
Flavour Fragr. J., 1998, 13, 1, 63-64, https://doi.org/10.1002/(SICI)1099-1026(199801/02)13:1<63::AID-FFJ694>3.0.CO;2-Z
. [all data]