1,4-Heptadiene, 3-methyl-
- Formula: C8H14
- Molecular weight: 110.1968
- IUPAC Standard InChIKey: FBJNXQPYIFUANI-VOTSOKGWSA-N
- CAS Registry Number: 1603-01-6
- Chemical structure:
View 3d structure (requires JavaScript / HTML 5) - Other names: 3-Methyl-1,4-heptadiene

Phase change data

Data compiled by: Thermodynamics Research Center, NIST Boulder Laboratories, Chris Muzny director
Quantity | Value | Units | Method | Reference | Comment |
---|---|---|---|---|---|
Tboil | 378.1 | K | N/A | Anonymous, 1955 | Uncertainty assigned by TRC = 0.4 K |
Tboil | 378.4 | K | N/A | Anonymous, 1955 | Uncertainty assigned by TRC = 0.6 K |

References

Anonymous, 1955
Anonymous, R.,
, Am. Pet. Inst. Res. Proj. 45, Tech. Rep. 14, No. 1, Ohio State Univ., 1955. [all data]