Iodotrimethylsilane
- Formula: C3H9ISi
- Molecular weight: 200.0935
- IUPAC Standard InChIKey: CSRZQMIRAZTJOY-UHFFFAOYSA-N
- CAS Registry Number: 16029-98-4
- Chemical structure:
View 3d structure (requires JavaScript / HTML 5) - Other names: Trimethylsilyl iodide; Silane, iodotrimethyl-; CT3610; Trimethyliodosilane

Phase change data

Data compiled by: Robert L. Brown and Stephen E. Stein
Quantity | Value | Units | Method | Reference | Comment |
---|---|---|---|---|---|
Tboil | 379. to 380. | K | N/A | Farchan Laboratories, 1990 | |
Tboil | 379. to 380. | K | N/A | PCR Inc., 1990 |

Gas phase ion energetics data

Data compiled as indicated in comments:
RDSH - Henry M. Rosenstock, Keith Draxl, Bruce W. Steiner, and John T. Herron
LBLHLM - Sharon G. Lias, John E. Bartmess, Joel F. Liebman, John L. Holmes, Rhoda D. Levin, and W. Gary Mallard

Ionization energy determinations

IE (eV) Method Reference Comment
8.9 ± 0.1EIBand, Davidson, et al., 1968RDSH

Appearance energy determinations

Ion AE (eV) Other Products MethodReferenceComment
C2H6SiI+10.3 ± 0.1CH3EIBand, Davidson, et al., 1968RDSH
C3H9Si+9.68 ± 0.01IPIPECOSzepes and Baer, 1984T = 298K; LBLHLM
C3H9Si+9.87 ± 0.01IPIPECOSzepes and Baer, 1984T = 0K; LBLHLM
C3H9Si+9.87 ± 0.01IPIPECOSzepes and Baer, 1984, 2T = 0K; LBLHLM
C3H9Si+10.1 ± 0.1IEIBand, Davidson, et al., Commun. 1967RDSH

References

Farchan Laboratories, 1990
Farchan Laboratories,
Research Chemicals Catalog, Farchan Laboratories, Gainesville, FL, 1990, 91. [all data]
PCR Inc., 1990
PCR Inc.,
Research Chemicals Catalog 1990-1991, PCR Inc., Gainesville, FL, 1990, 1. [all data]