1H-Pentachloropropene
- Formula: C3HCl5
- Molecular weight: 214.305
- IUPAC Standard InChIKey: MAXQCYDCBHPIAB-UHFFFAOYSA-N
- CAS Registry Number: 1600-37-9
- Chemical structure:
View 3d structure (requires JavaScript / HTML 5) - Other names: 1-Propene, 1,1,2,3,3-pentachloro-; 1,1,2,3,3-pentachloropropene

Normal alkane RI, non-polar column, custom temperature program

Column type | Active phase | I | Reference | Comment |
---|---|---|---|---|
Capillary | Methyl Silicone | 1041. | Zenkevich, 2001 | Program: not specified |
Capillary | Methyl Silicone | 1044. | Zenkevich, 2001 | Program: not specified |

References

Zenkevich, 2001
Zenkevich, I.G.,
Comparative Characterization of Conditions for Unambuguous Chromatographic Identification of Organic Compounds,
Zh. Anal. Khim., 2001, 56, 9, 915-924. [all data]