trans-1-Phenyl-1-pentene
- Formula: C11H14
- Molecular weight: 146.2289
- IUPAC Standard InChIKey: KHMYONNPZWOTKW-VMPITWQZSA-N
- CAS Registry Number: 16002-93-0
- Chemical structure:
View 3d structure (requires JavaScript / HTML 5) - Stereoisomers:
- Other names: (1E)-1-Pentenylbenzene; Benzene, 1-pentenyl-, trans

Kovats' RI, non-polar column, isothermal

Column type | Active phase | Temperature (C) | I | Reference | Comment |
---|---|---|---|---|---|
Capillary | OV-101 | 100. | 1205. | Engewald, Topalova, et al., 1987 | Column length: 50. m; Column diameter: 0.30 mm |

References

Engewald, Topalova, et al., 1987
Engewald, W.; Topalova, I.; Petsev, N.; Dimitrov, Chr.,
Structure-Retention Correlations of Hydrocarbons in GLC and GSC. Alkenylbenzenes,
Chromatographia, 1987, 23, 8, 561-565, https://doi.org/10.1007/BF02324864
. [all data]