1-Docosene
- Formula: C22H44
- Molecular weight: 308.5848
- IUPAC Standard InChIKey: SPURMHFLEKVAAS-UHFFFAOYSA-N
- CAS Registry Number: 1599-67-3
- Chemical structure:
View 3d structure (requires JavaScript / HTML 5) - Other names: Docos-1-ene

Phase change data

Data compiled by: William E. Acree, Jr., James S. Chickos
Enthalpy of vaporization
ΔvapH (kJ/mol) | Temperature (K) | Reference | Comment |
---|---|---|---|
95.6 | 416. | Dykyj, Svoboda, et al., 1999 | Based on data from 401. to 640. K. |

Kovats' RI, non-polar column, temperature ramp

Column type | Active phase | I | Reference | Comment |
---|---|---|---|---|
Capillary | DB-5 | 2190. | Adams, Morris, et al., 2005 | 30. m/0.26 mm/0.25 μm, He, 3. K/min; Tstart: 60. C; Tend: 246. C |
Capillary | DB-5 | 2194. | Tellez, Estell, et al., 1997 | 30. m/0.25 mm/0.25 μm, He, 3. K/min; Tstart: 60. C; Tend: 240. C |

Van Den Dool and Kratz RI, non-polar column, temperature ramp

Column type | Active phase | I | Reference | Comment |
---|---|---|---|---|
Capillary | DB-5 | 2195. | Nogueira, Bittrich, et al., 2001 | 30. m/0.25 mm/0.25 μm, H2, 3. K/min; Tstart: 60. C; Tend: 240. C |

Van Den Dool and Kratz RI, non-polar column, custom temperature program

Column type | Active phase | I | Reference | Comment |
---|---|---|---|---|
Capillary | DB-5 | 2196. | Zaikin and Borisov, 2002 | He; Column length: 30. m; Column diameter: 0.25 mm; Program: 30C => 5K/min=120C => 10C/min => 270C |

Normal alkane RI, non-polar column, temperature ramp

Column type | Active phase | I | Reference | Comment |
---|---|---|---|---|
Capillary | HP-5 MS | 2188. | Xu, Han, et al., 2012 | 30. m/0.25 mm/0.25 μm, 60. C @ 2. min, 15. K/min, 300. C @ 10. min |
Capillary | HP-5 MS | 2194. | Radulovic, Blagojevic, et al., 2010 | 30. m/0.25 mm/0.25 μm, Helium, 5. K/min, 290. C @ 10. min; Tstart: 70. C |
Capillary | HP-5 MS | 2194. | Radulovic, Blagojevic, et al., 2009 | 30. m/0.25 mm/0.25 μm, Helium, 5. K/min, 290. C @ 10. min; Tstart: 70. C |
Capillary | HP-5 MS | 2188. | Xu, Han, et al., 2009 | 30. m/0.25 mm/0.25 μm, Helium, 60. C @ 2. min, 15. K/min, 300. C @ 10. min |
Capillary | HP-5 | 2192. | Saidana, Mahjoub, et al., 2008 | 30. m/0.25 mm/0.25 μm, Nitrogen, 50. C @ 1. min, 5. K/min, 280. C @ 1. min |
Capillary | DB-5 | 2192. | Morteza-Semnani, Saeedi, et al., 2006 | 30. m/0.25 mm/0.25 μm, He, 60. C @ 4. min, 4. K/min; Tend: 260. C |
Capillary | Petrocol DH | 2192. | Sojak, Kubinec, et al., 2006 | 150. m/0.25 mm/1.0 μm, 1. K/min; Tstart: 40. C; Tend: 300. C |
Capillary | DB-1 | 2195. | Tohar, Mohd, et al., 2006 | 30. m/0.32 mm/0.25 μm, 60. C @ 3. min, 3. K/min, 230. C @ 10. min |
Capillary | DB-5 | 2191. | Morteza-Semnani and Saeedi, 2005 | 30. m/0.25 mm/0.25 μm, He, 60. C @ 4. min, 4. K/min; Tend: 220. C |
Capillary | HP-5 | 2194. | Utsunomia, Kawata, et al., 2005 | 30. m/0.32 mm/0.25 μm, Helium, 4. K/min, 300. C @ 5. min; Tstart: 40. C |
Capillary | OV-1 | 2188. | Ramaroson-Raonizafinimanana, Gaydou, et al., 1997 | 25. m/0.31 mm/0.15 μm, H2, 3. K/min; Tstart: 70. C; Tend: 220. C |
Capillary | DB-1 | 2191. | Shiota, 1993 | 30. m/0.25 mm/0.25 μm, He, 50. C @ 3. min, 5. K/min; Tend: 240. C |
Capillary | DB-1 | 2200. | Shiota, 1993 | 30. m/0.25 mm/0.25 μm, He, 50. C @ 3. min, 5. K/min; Tend: 240. C |
Capillary | Ultra-1 | 2189. | Okumura, 1991 | 25. m/0.32 mm/0.25 μm, He, 3. K/min; Tstart: 80. C; Tend: 260. C |
Capillary | CP Sil 8 CB | 2188. | Yruela, Barbe, et al., 1990 | 25. m/0.20 mm/0.13 μm, H2, 6. K/min; Tstart: 60. C; Tend: 300. C |

Normal alkane RI, non-polar column, custom temperature program

Column type | Active phase | I | Reference | Comment |
---|---|---|---|---|
Capillary | DB-5 | 2195. | Yusuf and Bewaji, 2011 | Column length: 30. m; Column diameter: 0.32 mm; Program: not specified |
Capillary | DB-5 | 2195. | Yusuf and Bewaji, 2011 | Column length: 30. m; Column diameter: 0.32 mm; Program: not specified |
Capillary | DB-5 | 2195. | Yusuf and Bewaji, 2011, 2 | Helium; Column length: 30. m; Column diameter: 0.32 mm; Program: not specified |

References

Dykyj, Svoboda, et al., 1999
Dykyj, J.; Svoboda, J.; Wilhoit, R.C.; Frenkel, M.L.; Hall, K.R.,
Vapor Pressure of Chemicals: Part A. Vapor Pressure and Antoine Constants for Hydrocarbons and Sulfur, Selenium, Tellurium and Hydrogen Containing Organic Compounds, Springer, Berlin, 1999, 373. [all data]
Adams, Morris, et al., 2005
Adams, R.P.; Morris, J.A.; Pandey, R.N.; Schwarzbach, A.E.,
Cryptic speciation between Juniperus deltoides and Juniperus oxycedrus (Cupressaceae) in the Mediterranean,
Biochem. Syst. Ecol., 2005, 33, 8, 771-787, https://doi.org/10.1016/j.bse.2005.01.001
. [all data]
Tellez, Estell, et al., 1997
Tellez, M.R.; Estell, R.E.; Fredrickson, E.L.; Havstad, K.M.,
Essential oil of Dyssodia acerosa DC.,
J. Agric. Food Chem., 1997, 45, 8, 3276-3278, https://doi.org/10.1021/jf9701502
. [all data]
Nogueira, Bittrich, et al., 2001
Nogueira, P.C.L.; Bittrich, V.; Shepherd, G.J.; Lopes, A.V.; Marsaioli, A.J.,
The ecological and taxonomic importance of flower volatiles of Clusia species (Guttiferae),
Phytochemistry, 2001, 56, 5, 443-452, https://doi.org/10.1016/S0031-9422(00)00213-2
. [all data]
Zaikin and Borisov, 2002
Zaikin, V.G.; Borisov, R.S.,
Chromatographic-mass spectrometric analysis of Fishcer-Tropsch synthesis products,
J. Anal. Chem. USSR (Engl. Transl.), 2002, 57, 6, 544-551. [all data]
Xu, Han, et al., 2012
Xu, L.-L.; Han, T.; Wu, J.-Z.; Zhang, Q.-Y.; Zhang, H.; Huang, B.-K.; Rahman, K.,
Comparative research of chemical constituents, antifungal and antitumor properties of ether extracts of Panax ginseng and its endophytic fungus, 2012, retrieved from http://www.thefreelibrary.com/Comparative .... [all data]
Radulovic, Blagojevic, et al., 2010
Radulovic, N.; Blagojevic, P.; Palic, R.,
Comparative study of the leaf volatiles of Arctostaphylos uva-ursi (L.) Spreng. and Vaccinium vitis-idaea L. (Ericaceae),
Molecules, 2010, 15, 9, 6168-6185, https://doi.org/10.3390/molecules15096168
. [all data]
Radulovic, Blagojevic, et al., 2009
Radulovic, N.S.; Blagojevic, P.D.; Palic, R.M.; Zlatkovic, B.K.; Stevanovic, B.M.,
Volatiles from vegetative organs of the paleoendemic resurrection plants Ramonda serbica Panc. and Ramonda nathaliae Panc. at Petrov,
J. Serb. Chem. Soc., 2009, 74, 1, 35-44, https://doi.org/10.2298/JSC0901035R
. [all data]
Xu, Han, et al., 2009
Xu, L.-L.; Han, T.; Wu, J.-Z.; Zhang, Q.-Y.; Zhang, H.; Huang, B.-K.; Rahman, K.,
Comparative research of chemical constituents, antifungal and antitumor properties of ether extracts of Panax ginseng and its endophytic fungus,
Phytomedicine: Int. J. Phytotherapy Phytopharmacology, 2009, 16, 6-7, 609-616, https://doi.org/10.1016/j.phymed.2009.03.014
. [all data]
Saidana, Mahjoub, et al., 2008
Saidana, D.; Mahjoub, M.A.; Boussaada, O.; Chriaa, J.; Cheraif, I.; Daami, M.; Mighri, Z.; Helal, A.N.,
Chemical composition and antimicrobial activity of volatile compounds of Tamarix boveana (Tamaricaceae),
Microbiol. Res., 2008, 163, 4, 445-455, https://doi.org/10.1016/j.micres.2006.07.009
. [all data]
Morteza-Semnani, Saeedi, et al., 2006
Morteza-Semnani, K.; Saeedi, M.; Akbarsadeh, M.; Moshiri, K.,
The essential oil composition of Onosma microcarpum DC.,
Flavour Fragr. J., 2006, 21, 2, 314-316, https://doi.org/10.1002/ffj.1597
. [all data]
Sojak, Kubinec, et al., 2006
Sojak, L.; Kubinec, R.; Jurdakova, H.; Hajekova, E.; Bajus, M.,
GC-MS of polyethylene and polypropylene thermal cracking produxts,
Petroleum Coal, 2006, 48, 1, 1-14. [all data]
Tohar, Mohd, et al., 2006
Tohar, N.; Mohd, M.A.; Jantan, I.; Awang, K.,
A comparative study of the essential oils of the genus Plumeria Linn. from Malaysia,
Flavour Fragr. J., 2006, 21, 6, 859-863, https://doi.org/10.1002/ffj.1617
. [all data]
Morteza-Semnani and Saeedi, 2005
Morteza-Semnani, K.; Saeedi, M.,
The essential oil composition of Phlomis bruguieri Desf. from Iran,
Flavour Fragr. J., 2005, 20, 3, 344-346, https://doi.org/10.1002/ffj.1459
. [all data]
Utsunomia, Kawata, et al., 2005
Utsunomia, H.; Kawata, J.; Chanoki, W.; Shirakawa, N.; Miyazawa, M.,
Components of Essential Oil from Woods of Prunus mume Sieb. at Zucc.,
J. Oleo Sci., 2005, 54, 11, 609-612, https://doi.org/10.5650/jos.54.609
. [all data]
Ramaroson-Raonizafinimanana, Gaydou, et al., 1997
Ramaroson-Raonizafinimanana, B.; Gaydou, E.M.; Bombarda, I.,
Hydrocarbons from three vanilla bean species: V. fragrans, V. madagascariensis, and V. tahitensis,
J. Agric. Food Chem., 1997, 45, 7, 2542-2545, https://doi.org/10.1021/jf960927b
. [all data]
Shiota, 1993
Shiota, H.,
New esteric components in the volatiles of banana fruit (Musa sapientum L.),
J. Agric. Food Chem., 1993, 41, 11, 2056-2062, https://doi.org/10.1021/jf00035a046
. [all data]
Okumura, 1991
Okumura, T.,
retention indices of environmental chemicals on methyl silicone capillary column,
Journal of Environmental Chemistry (Japan), 1991, 1, 2, 333-358, https://doi.org/10.5985/jec.1.333
. [all data]
Yruela, Barbe, et al., 1990
Yruela, I.; Barbe, A.; Grimalt, J.O.,
Determination of Double Bond Position and Geometry in Linear and High Branched Hydrocarbons and Fatty Acids from Gas Chromatography-Mass Spectrometry of Epoxides and Diols Generated by Stereospecific Resin Hydration,
J. Chromatogr. Sci., 1990, 28, 8, 421-427, https://doi.org/10.1093/chromsci/28.8.421
. [all data]
Yusuf and Bewaji, 2011
Yusuf, O.K.; Bewaji, C.O.,
Evaluation of essential oils composition of methanolic Allium sativum extract on Trypanosoma brucei infected rats,
Res. Pharmaceutical Biotechnol., 2011, 3, 2, 17-21. [all data]
Yusuf and Bewaji, 2011, 2
Yusuf, O.K.; Bewaji, C.O.,
GC-MS of volatile components of fermented wheat germ extract,
J. Cereals Oilseeds, 2011, 2, 3, 38-42. [all data]