Benzeneacetic acid, 3,4-dimethoxy-, methyl ester
- Formula: C11H14O4
- Molecular weight: 210.2265
- IUPAC Standard InChIKey: DILOFCBIBDMHAY-UHFFFAOYSA-N
- CAS Registry Number: 15964-79-1
- Chemical structure:
View 3d structure (requires JavaScript / HTML 5) - Other names: Acetic acid, (3,4-dimethoxyphenyl)-, methyl ester; Homoveratric acid, methyl ester; Methyl (3,4-dimethoxyphenyl)acetate; Methyl ester of 3,4-dimethoxyphenylacetic acid; Homovanillic acid di-methyl derivative; Phenylacetic acid, 3,4-dimethoxy, methyl ester; (3,4-Dimethoxy-phenyl)-acetic acid methyl ester

Van Den Dool and Kratz RI, non-polar column, custom temperature program

Column type | Active phase | I | Reference | Comment |
---|---|---|---|---|
Capillary | VF-5MS | 1625.3 | Tret'yakov, 2007 | 30. m/0.25 mm/0.25 μm, He; Program: Multi-step temperature program; T(initial)=60C; T(final)=270C |

Normal alkane RI, non-polar column, temperature ramp

Column type | Active phase | I | Reference | Comment |
---|---|---|---|---|
Capillary | OV-101 | 1579. | Pinkston, Spiteller, et al., 1981 | H2, 80. C @ 7. min, 2. K/min; Column length: 30. m; Column diameter: 0.3 mm; Tend: 275. C |
Capillary | OV-101 | 1583. | Spiteller and Spiteller, 1979 | He, 75. C @ 7. min, 2. K/min; Column length: 25. m; Tend: 280. C |

References

Tret'yakov, 2007
Tret'yakov, K.V.,
Retention Data. NIST Mass Spectrometry Data Center., NIST Mass Spectrometry Data Center, 2007. [all data]
Pinkston, Spiteller, et al., 1981
Pinkston, D.; Spiteller, G.; von Henning, H.; Matthaei, D.,
High-resolution gas chromatography-mass spectrometry of the methyl esters of organic acids from uremic hemofiltrates,
J. Chromatogr., 1981, 223, 1, 1-19, https://doi.org/10.1016/S0378-4347(00)80063-8
. [all data]
Spiteller and Spiteller, 1979
Spiteller, M.; Spiteller, G.,
Trennung und charakterisierung saurer harnbest and- teile,
J. Chromatogr., 1979, 164, 3, 253-317, https://doi.org/10.1016/S0378-4347(00)81232-3
. [all data]