Benzene, 1-butyl-2-methyl-
- Formula: C11H16
- Molecular weight: 148.2447
- IUPAC Standard InChIKey: NUJILYKLNKQOOX-UHFFFAOYSA-N
- CAS Registry Number: 1595-11-5
- Chemical structure:
View 3d structure (requires JavaScript / HTML 5) - Other names: 1-Methyl-2-butylbenzene; 1-Butyl-2-methylbenzene; Toluene, o-butyl-; 1-Methyl-2-n-Butylbenzene

Phase change data

Data compiled by: Thermodynamics Research Center, NIST Boulder Laboratories, Chris Muzny director
Quantity | Value | Units | Method | Reference | Comment |
---|---|---|---|---|---|
Tboil | 474. | K | N/A | Niemczycki, 1899 | Uncertainty assigned by TRC = 8. K |

Normal alkane RI, non-polar column, custom temperature program

Data compiled by: NIST Mass Spectrometry Data Center, William E. Wallace, director

Column type CapillaryCapillary
Active phase SE-30OV-101
Column length (m)  52.
Carrier gas  H2
Substrate
Column diameter (mm)  0.25
Phase thickness (μm)  0.38
Program not specified70 - 160 C at 1.5 deg/min; 160 - 280 C at 15 deg/min 15 min at 280 C
I 1154.1153.
ReferenceXiuhua, Zhang, et al., 1996Matisová, Juranyiová, et al., 1991
Comment MSDC-RI MSDC-RI

Kovats' RI, polar column, isothermal

Data compiled by: NIST Mass Spectrometry Data Center, William E. Wallace, director

Column type Capillary
Active phase Carbowax 20M
Column length (m) 100.
Carrier gas
Substrate
Column diameter (mm) 0.2
Phase thickness (μm)
Temperature (C) 90.
I 1395.8
ReferenceDöring, Estel, et al., 1974
Comment MSDC-RI

References

Niemczycki, 1899
Niemczycki, S.,
Bull. Int. Acad. Sci. Cracovie, 1899, 473. [all data]