Phenol, 2,3,4-trichloro-
- Formula: C6H3Cl3O
- Molecular weight: 197.446
- IUPAC Standard InChIKey: HSQFVBWFPBKHEB-UHFFFAOYSA-N
- CAS Registry Number: 15950-66-0
- Chemical structure:
View 3d structure (requires JavaScript / HTML 5) - Other names: 2,3,4-Trichlorophenol

Kovats' RI, non-polar column, isothermal

Column type | Active phase | Temperature (C) | I | Reference | Comment |
---|---|---|---|---|---|
Capillary | SE-30 | 160. | 1363. | Evans and Haken, 1989 | Column length: 25. m; Column diameter: 0.32 mm |
Capillary | SE-30 | 140. | 1345. | Korhonen, 1984 | |
Capillary | SE-30 | 160. | 1363. | Korhonen, 1984 | |
Capillary | SE-30 | 180. | 1380. | Korhonen, 1984 |

Kovats' RI, polar column, isothermal

Column type | Active phase | Temperature (C) | I | Reference | Comment |
---|---|---|---|---|---|
Capillary | FFAP | 160. | 2453. | Evans and Haken, 1989 | Column length: 25. m; Column diameter: 0.35 mm |
Capillary | FFAP | 160. | 2453. | Korhonen, 1984 | |
Capillary | FFAP | 180. | 2460. | Korhonen, 1984 | |
Capillary | FFAP | 200. | 2476. | Korhonen, 1984 |

Van Den Dool and Kratz RI, non-polar column, temperature ramp

Column type | Active phase | I | Reference | Comment |
---|---|---|---|---|
Capillary | SE-30 | 1364. | Korhonen, 1984 | 10. K/min; Tstart: 100. C |
Capillary | SE-30 | 1340. | Korhonen, 1984 | 2. K/min; Tstart: 100. C |
Capillary | SE-30 | 1354. | Korhonen, 1984 | 6. K/min; Tstart: 100. C |

Van Den Dool and Kratz RI, polar column, temperature ramp

Column type | Active phase | I | Reference | Comment |
---|---|---|---|---|
Capillary | FFAP | 2458. | Korhonen, 1984 | 10. K/min; Tstart: 100. C |
Capillary | FFAP | 2424. | Korhonen, 1984 | 2. K/min; Tstart: 100. C |
Capillary | FFAP | 2447. | Korhonen, 1984 | 6. K/min; Tstart: 100. C |

Normal alkane RI, non-polar column, custom temperature program

Column type | Active phase | I | Reference | Comment |
---|---|---|---|---|
Capillary | PTE-5 | 1405. | Nakano, Fujimori, et al., 1992 | 25. m/0.20 mm/0.33 μm; Program: 50 0C (2 min) 30 0C/min -> 200 0C 8 0C/min -> 280 0C (10 min) |
Capillary | Ultra-2 | 1408. | Nakano, Fujimori, et al., 1992 | 25. m/0.20 mm/0.33 μm; Program: 50 0C (2 min) 30 0C/min -> 200 0C 8 0C/min -> 280 0C (10 min) |

References

Evans and Haken, 1989
Evans, M.B.; Haken, J.K.,
Dispersion and selectivity indices in gas chromatography. IV. Chlorinated aromatic compounds,
J. Chromatogr., 1989, 468, 373-382, https://doi.org/10.1016/S0021-9673(00)96332-5
. [all data]
Korhonen, 1984
Korhonen, I.O.O.,
Gas-liquid chromatographic analyses. XXXI. Retention increments of isomeric chlorophenols on low-polarity (SE-30) and polar (FFAP) capillary columns,
J. Chromatogr., 1984, 315, 185-200, https://doi.org/10.1016/S0021-9673(01)90736-8
. [all data]
Nakano, Fujimori, et al., 1992
Nakano, T.; Fujimori, K.; Takaishi, Y.; Okuno, T.,
GC/MS-SIM analysis of polychlorobenzenes, polychlorophenols and polychloronaphthalenes,
Report of the Environmental Science Institute of Hyogo Prefecture, 1992, 24, 30-37. [all data]