2,3-Dihydro-7-(1-methylethoxy)-3-[2-(nitrooxy)ethyl]-4H-1,3-benzoxazin-4-one

Phase change data

Data compiled by: William E. Acree, Jr., James S. Chickos

Enthalpy of fusion

ΔfusH (kJ/mol) Temperature (K) Method Reference
32.1344.7DSCFontana, Rosati, et al., 1996

References

Fontana, Rosati, et al., 1996
Fontana, L.; Rosati, L.; Sala, A.; Dobetti, L., Physico-chemical parameters of nitrate esters. A contribution to the choice of a candidate for preclinical development, Pharmaceutica Acta Helvetiae, 1996, 71, 5, 341-343, https://doi.org/10.1016/S0031-6865(96)00025-8 . [all data]