(E)-3-Tert-butyl-7,7-dimethyl-3-octen-1,5-diyne

Reaction thermochemistry data

Data compiled by: Hussein Y. Afeefy, Joel F. Liebman, and Stephen E. Stein

Individual Reactions

(E)-3-Tert-butyl-7,7-dimethyl-3-octen-1,5-diyne = 3-Octene-1,5-diyne, 3-(1,1-dimethylethyl)-7,7-dimethyl-, (Z)-

By formula: C14H20 = C14H20

Quantity Value Units Method Reference Comment
Δr0.9 ± 1.6kcal/molEqkRoth, Hopf, et al., 1994gas phase; At 931 K

References

Roth, Hopf, et al., 1994
Roth, W.R.; Hopf, H.; Horn, C., Propargyl-Stabilisierungsenergie, Chem. Ber., 1994, 127, 1781-1795. [all data]